Benzene, 1-bromo-3,5-dichloro-
- Formula: C6H3BrCl2
- Molecular weight: 225.898
- IUPAC Standard InChIKey: DZHFFMWJXJBBRG-UHFFFAOYSA-N
- CAS Registry Number: 19752-55-7
- Chemical structure:
View 3d structure (requires JavaScript / HTML 5) - Other names: 1-Bromo-3,5-dichlorobenzene; 3,5-Dichlorobromobenzene

Phase change data

Data compiled by: Robert L. Brown and Stephen E. Stein
Quantity | Value | Units | Method | Reference | Comment |
---|---|---|---|---|---|
Tboil | 505. | K | N/A | Buckingham and Donaghy, 1982 | |
Quantity | Value | Units | Method | Reference | Comment |
Tfus | 355. to 357. | K | N/A | Buckingham and Donaghy, 1982 |
Reduced pressure boiling point
Tboil (K) | Pressure (bar) | Reference |
---|---|---|
505.2 | 1.01 | Weast and Grasselli, 1989 |

References

Buckingham and Donaghy, 1982
Buckingham, J.; Donaghy, S.M.,
Dictionary of Organic Compounds: Fifth Edition, Chapman and Hall, New York, 1982, 1. [all data]
Weast and Grasselli, 1989
CRC Handbook of Data on Organic Compounds, 2nd Editon, Weast,R.C and Grasselli, J.G., ed(s)., CRC Press, Inc., Boca Raton, FL, 1989, 1. [all data]