Methylhydrindan
- Formula: C10H18
- Molecular weight: 138.2499
- IUPAC Standard InChIKey: FIPKSKMDTAQBDJ-UHFFFAOYSA-N
- CAS Registry Number: 19744-65-1
- Chemical structure:
View 3d structure (requires JavaScript / HTML 5) - Species with the same structure:

Condensed phase thermochemistry data

Data compiled by: Hussein Y. Afeefy, Joel F. Liebman, and Stephen E. Stein
Quantity | Value | Units | Method | Reference | Comment |
---|---|---|---|---|---|
ΔcH°liquid | -6157.4 | kJ/mol | Ccb | Gollis, Belenyessy, et al., 1962 | Mixed isomers; Corresponding ΔfHºliquid = -350.2 kJ/mol (simple calculation by NIST; no Washburn corrections) |

References

Gollis, Belenyessy, et al., 1962
Gollis, M.H.; Belenyessy, L.I.; Gudzinowicz, B.J.; Koch, S.D.; Smith, J.O.; Wineman, R.J.,
Evaluation of pure hydrocarbons as jet fuels,
J. Chem. Eng. Data, 1962, 7, 331-316. [all data]