Benzene, 1-bromo-2-ethyl-
- Formula: C8H9Br
- Molecular weight: 185.061
- IUPAC Standard InChIKey: HVRUGFJYCAFAAN-UHFFFAOYSA-N
- CAS Registry Number: 1973-22-4
- Chemical structure:
View 3d structure (requires JavaScript / HTML 5) - Other names: o-Bromoethylbenzene; 1-Bromo-2-ethylbenzene; 2-Bromo-1-ethylbenzene; 2-Ethylbromobenzene; 1-Ethyl-2-bromobenzene

Phase change data

Data compiled as indicated in comments:
BS - Robert L. Brown and Stephen E. Stein
TRC - Thermodynamics Research Center, NIST Boulder Laboratories, Chris Muzny director
AC - William E. Acree, Jr., James S. Chickos
Quantity | Value | Units | Method | Reference | Comment |
---|---|---|---|---|---|
Tboil | 472.5 | K | N/A | Weast and Grasselli, 1989 | BS |
Tboil | 474.65 | K | N/A | Dreisbach and Martin, 1949 | Uncertainty assigned by TRC = 0.07 K; TRC |
Quantity | Value | Units | Method | Reference | Comment |
Tfus | 205.9 | K | N/A | Lamneck and Wise, 1954 | Uncertainty assigned by TRC = 0.7 K; TRC |
Tfus | 205.61 | K | N/A | Dreisbach and Martin, 1949 | Uncertainty assigned by TRC = 0.05 K; TRC |
Enthalpy of vaporization
ΔvapH (kJ/mol) | Temperature (K) | Method | Reference | Comment |
---|---|---|---|---|
48.1 | 383. | A | Stephenson and Malanowski, 1987 | Based on data from 368. to 523. K. See also Dykyj and Vanko, 1970 and Dykyj, Svoboda, et al., 1999.; AC |

Reaction thermochemistry data

Data compiled by: Hussein Y. Afeefy, Joel F. Liebman, and Stephen E. Stein
Individual Reactions
= C8H9Br
By formula: C8H9Br = C8H9Br
Quantity | Value | Units | Method | Reference | Comment |
---|---|---|---|---|---|
ΔrH° | -1.20 ± 0.33 | kJ/mol | Cm | Merdzhanov, Alenin, et al., 1982 | gas phase; Heat of isomerization at 330 K |

Henry's Law data

Data compiled by: Rolf Sander
Henry's Law constant (water solution)
kH(T) = k°H exp(d(ln(kH))/d(1/T) ((1/T) - 1/(298.15 K)))
k°H = Henry's law constant for solubility in water at 298.15 K (mol/(kg*bar))
d(ln(kH))/d(1/T) = Temperature dependence constant (K)
k°H (mol/(kg*bar)) | d(ln(kH))/d(1/T) (K) | Method | Reference |
---|---|---|---|
0.30 | V | N/A |

Van Den Dool and Kratz RI, non-polar column, temperature ramp

Column type | Active phase | I | Reference | Comment |
---|---|---|---|---|
Capillary | OV-1 | 1166.0 | Gautzsch and Zinn, 1996 | 8. K/min; Tstart: 35. C; Tend: 300. C |

References

Weast and Grasselli, 1989
CRC Handbook of Data on Organic Compounds, 2nd Editon, Weast,R.C and Grasselli, J.G., ed(s)., CRC Press, Inc., Boca Raton, FL, 1989, 1. [all data]
Dreisbach and Martin, 1949
Dreisbach, R.R.; Martin, R.A.,
Physical Data on Some Organic Compounds,
Ind. Eng. Chem., 1949, 41, 2875-8. [all data]
Lamneck and Wise, 1954
Lamneck, J.H.; Wise, P.H.,
Dicyclic Hydrocarbons XI. Synthesis and Physical Properties of the Monoethyldiphenylmethanes and Monoethyldicyclohexylmethanes,
J. Am. Chem. Soc., 1954, 76, 5108. [all data]
Stephenson and Malanowski, 1987
Stephenson, Richard M.; Malanowski, Stanislaw,
Handbook of the Thermodynamics of Organic Compounds, 1987, https://doi.org/10.1007/978-94-009-3173-2
. [all data]
Dykyj and Vanko, 1970
Dykyj, J.; Vanko, A.,
Petrochemica, 1970, 10, 1, 3. [all data]
Dykyj, Svoboda, et al., 1999
Dykyj, J.; Svoboda, J.; Wilhoit, R.C.; Frenkel, M.L.; Hall, K.R.,
Vapor Pressure of Chemicals: Part A. Vapor Pressure and Antoine Constants for Hydrocarbons and Sulfur, Selenium, Tellurium and Hydrogen Containing Organic Compounds, Springer, Berlin, 1999, 373. [all data]
Merdzhanov, Alenin, et al., 1982
Merdzhanov, V.R.; Alenin, V.I.; Nesterova, T.N.; Rozhnov, A.M.,
Study of equilibrium transformation of ethylbromobenzenes,
Izv. Vyssh. Uchebn. Zaved., Khim. Khim. Tekhnol., 1982, 25, 1047-1049. [all data]
Gautzsch and Zinn, 1996
Gautzsch, R.; Zinn, P.,
Use of incremental models to estimate the retention indexes of aromatic compounds,
Chromatographia, 1996, 43, 3/4, 163-176, https://doi.org/10.1007/BF02292946
. [all data]