N-Acetylproline-N'-methylamide(L)
- Formula: C8H14N2O2
- Molecular weight: 170.2090
- IUPAC Standard InChIKey: DPDXFAYSYVRXMF-SSDOTTSWSA-N
- CAS Registry Number: 19701-85-0
- Chemical structure:
View 3d structure (requires JavaScript / HTML 5) - Permanent link for this species. Use this link for bookmarking this species for future reference.

Condensed phase thermochemistry data

Data compiled by: Eugene S. Domalski and Elizabeth D. Hearing
Constant pressure heat capacity of solid
Cp,solid (J/mol*K) | Temperature (K) | Reference | Comment |
---|---|---|---|
222.90 | 298. | Abate, Della Gatta, et al., 1991 | Data extrapolated to 298 K from values obtained at higher temperatures. |

Phase change data

Data compiled by: William E. Acree, Jr., James S. Chickos
Enthalpy of sublimation
ΔsubH (kJ/mol) | Temperature (K) | Method | Reference | Comment |
---|---|---|---|---|
69.1 | 313. | A | Stephenson and Malanowski, 1987 | Based on data from 308. to 318. K. See also Aihara, 1955. |

References

Abate, Della Gatta, et al., 1991
Abate, L.; Della Gatta, G.; Somsen, G.,
Heat capacities of solid small peptides by an improved DSC method,
Calorim. Anal. Therm., 1991, 22, 233-236. [all data]
Stephenson and Malanowski, 1987
Stephenson, Richard M.; Malanowski, Stanislaw,
Handbook of the Thermodynamics of Organic Compounds, 1987, https://doi.org/10.1007/978-94-009-3173-2
. [all data]
Aihara, 1955
Aihara, A.,
J. Chem. Soc. Jpn. Pure Chem. Sect., 1955, 76, 495. [all data]