Heptane, 1-ethoxy-
- Formula: C9H20O
- Molecular weight: 144.2545
- IUPAC Standard InChIKey: UTBWZYCUAYXAKT-UHFFFAOYSA-N
- CAS Registry Number: 1969-43-3
- Chemical structure:
View 3d structure (requires JavaScript / HTML 5) - Other names: Ether, ethyl heptyl; Ethyl heptyl ether

Phase change data

Data compiled by: Thermodynamics Research Center, NIST Boulder Laboratories, Chris Muzny director
Quantity | Value | Units | Method | Reference | Comment |
---|---|---|---|---|---|
Tfus | 204.85 | K | N/A | Timmermans, 1952 | Uncertainty assigned by TRC = 0.4 K |

References

Timmermans, 1952
Timmermans, J.,
Freezing points of organic compounds. VVI New determinations.,
Bull. Soc. Chim. Belg., 1952, 61, 393. [all data]