20-(S)-10-hydroxycamptothecin

Phase change data

Data compiled by: William E. Acree, Jr., James S. Chickos

Enthalpy of fusion

ΔfusH (kJ/mol) Temperature (K) Method Reference
53.38467.2DSCKunadharaju and Savva, 2010

References

Kunadharaju and Savva, 2010
Kunadharaju, Sasank; Savva, Michalakis, Thermodynamic Studies of 10-Hydroxy-camptothecin in Aqueous Solutions, J. Chem. Eng. Data, 2010, 55, 1, 103-112, https://doi.org/10.1021/je900283v . [all data]