Dipropyl terephthalate
- Formula: C14H18O4
- Molecular weight: 250.2903
- IUPAC Standard InChIKey: GXJPKIGCMGAHTL-UHFFFAOYSA-N
- CAS Registry Number: 1962-74-9
- Chemical structure:
View 3d structure (requires JavaScript / HTML 5) - Other names: Terephthalic acid, dipropyl ester

Phase change data

Data compiled by: Robert L. Brown and Stephen E. Stein
Quantity | Value | Units | Method | Reference | Comment |
---|---|---|---|---|---|
Tfus | 304. | K | N/A | Buckingham and Donaghy, 1982 |
Reduced pressure boiling point
Tboil (K) | Pressure (bar) | Reference |
---|---|---|
431. | 0.005 | Buckingham and Donaghy, 1982 |

Kovats' RI, non-polar column, isothermal

Column type | Active phase | Temperature (C) | I | Reference | Comment |
---|---|---|---|---|---|
Capillary | OV-101 | 230. | 1850. | Friocourt, Berthou, et al., 1979 | 50. m/0.3 mm/0.35 μm, N2 |
Capillary | SE-30 | 251. | 1851. | Friocourt, Berthou, et al., 1979 | 50. m/0.3 mm/0.39 μm, He |

References

Buckingham and Donaghy, 1982
Buckingham, J.; Donaghy, S.M.,
Dictionary of Organic Compounds: Fifth Edition, Chapman and Hall, New York, 1982, 1. [all data]
Friocourt, Berthou, et al., 1979
Friocourt, M.P.; Berthou, F.; Picart, D.; Dreano, Y.; Floch, H.H.,
Glass Capillary Column Gas Chromatography of Phthalate Esters,
J. Chromatogr., 1979, 172, 1, 261-271, https://doi.org/10.1016/S0021-9673(00)90961-0
. [all data]