Pentaborane(9)
- Formula: B5H9
- Molecular weight: 63.126
- IUPAC Standard InChIKey: USBVLEBZPMQADS-UHFFFAOYSA-N
- CAS Registry Number: 19624-22-7
- Chemical structure:
View 3d structure (requires JavaScript / HTML 5) - Other names: Pentaborane; UN 1380; B5H9

Gas phase thermochemistry data

Quantity | Value | Units | Method | Reference | Comment |
---|---|---|---|---|---|
ΔfH°gas | 73.22 | kJ/mol | Review | Chase, 1998 | Data last reviewed in March, 1965 |
Quantity | Value | Units | Method | Reference | Comment |
S°gas,1 bar | 275.40 | J/mol*K | Review | Chase, 1998 | Data last reviewed in March, 1965 |
Gas Phase Heat Capacity (Shomate Equation)
Cp° = A + B*t + C*t2 + D*t3 +
E/t2
H° − H°298.15= A*t + B*t2/2 +
C*t3/3 + D*t4/4 − E/t + F − H
S° = A*ln(t) + B*t + C*t2/2 + D*t3/3 −
E/(2*t2) + G
Cp = heat capacity (J/mol*K)
H° = standard enthalpy (kJ/mol)
S° = standard entropy (J/mol*K)
t = temperature (K) / 1000.
View plot Requires a JavaScript / HTML 5 canvas capable browser.
Temperature (K) | 1500. to 6000. |
---|---|
A | 302.0563 |
B | 16.13748 |
C | -3.133799 |
D | 0.210327 |
E | -64.33193 |
F | -166.3023 |
G | 439.5501 |
H | 73.22000 |
Reference | Chase, 1998 |
Comment | Data last reviewed in March, 1965 |

References

Chase, 1998
Chase, M.W., Jr.,
NIST-JANAF Themochemical Tables, Fourth Edition,
J. Phys. Chem. Ref. Data, Monograph 9, 1998, 1-1951. [all data]