Imidodicarbonic acid, diethyl ester
- Formula: C6H11NO4
- Molecular weight: 161.1558
- IUPAC Standard InChIKey: PQVSTLUFSYVLTO-UHFFFAOYSA-N
- CAS Registry Number: 19617-44-8
- Chemical structure:
View 3d structure (requires JavaScript / HTML 5) - Permanent link for this species. Use this link for bookmarking this species for future reference.

Phase change data

Data compiled by: Robert L. Brown and Stephen E. Stein
Quantity | Value | Units | Method | Reference | Comment |
---|---|---|---|---|---|
Tboil | 499.2 | K | N/A | Weast and Grasselli, 1989 |
Reduced pressure boiling point
Tboil (K) | Pressure (bar) | Reference |
---|---|---|
405. to 407. | 0.020 | Frinton Laboratories Inc., 1986 |

References

Weast and Grasselli, 1989
CRC Handbook of Data on Organic Compounds, 2nd Editon, Weast,R.C and Grasselli, J.G., ed(s)., CRC Press, Inc., Boca Raton, FL, 1989, 1. [all data]
Frinton Laboratories Inc., 1986
Frinton Laboratories Inc.,
Catalog Number 11, Frinton Laboratories Inc., Vineland, NJ, 1986, 99. [all data]