Benzene, 1-bromo-2-(methylthio)-
- Formula: C7H7BrS
- Molecular weight: 203.099
- IUPAC Standard InChIKey: ALAQDUSTXPEHMH-UHFFFAOYSA-N
- CAS Registry Number: 19614-16-5
- Chemical structure:
View 3d structure (requires JavaScript / HTML 5) - Other names: o-Bromo(methylthio)benzene; o-Bromophenyl methyl sulfide; o-Bromothioanisole; Sulfide, o-bromophenyl methyl; 2-Bromothioanisole

Phase change data

Data compiled by: Robert L. Brown and Stephen E. Stein
Quantity | Value | Units | Method | Reference | Comment |
---|---|---|---|---|---|
Tfus | 248.6 | K | N/A | Buckingham and Donaghy, 1982 |
Reduced pressure boiling point
Tboil (K) | Pressure (bar) | Reference |
---|---|---|
418.7 | 0.036 | Aldrich Chemical Company Inc., 1990 |
529. | 1.02 | Buckingham and Donaghy, 1982 |
445. to 452. | 0.017 to 0.019 | Buckingham and Donaghy, 1982 |

References

Buckingham and Donaghy, 1982
Buckingham, J.; Donaghy, S.M.,
Dictionary of Organic Compounds: Fifth Edition, Chapman and Hall, New York, 1982, 1. [all data]
Aldrich Chemical Company Inc., 1990
Aldrich Chemical Company Inc.,
Catalog Handbook of Fine Chemicals, Aldrich Chemical Company, Inc., Milwaukee WI, 1990, 1. [all data]