1-bromo-2-propylbenzene
- Formula: C9H11Br
- Molecular weight: 199.088
- IUPAC Standard InChIKey: SRXJZMLETPOSSJ-UHFFFAOYSA-N
- CAS Registry Number: 19614-14-3
- Chemical structure:
View 3d structure (requires JavaScript / HTML 5) - Permanent link for this species. Use this link for bookmarking this species for future reference.

Phase change data

Data compiled by: Thermodynamics Research Center, NIST Boulder Laboratories, Chris Muzny director
Quantity | Value | Units | Method | Reference | Comment |
---|---|---|---|---|---|
Tboil | 490.35 | K | N/A | Lamneck, 1954 | Uncertainty assigned by TRC = 0.3 K |
Quantity | Value | Units | Method | Reference | Comment |
Tfus | 226.77 | K | N/A | Lamneck, 1954 | Uncertainty assigned by TRC = 0.02 K |

References

Lamneck, 1954
Lamneck, J.H.,
Bromination of the two propylbenzenes and three butylbenzenes,
J. Am. Chem. Soc., 1954, 76, 1106. [all data]