4-Cyano-1-butyne
- Formula: C5H5N
- Molecular weight: 79.0999
- IUPAC Standard InChIKey: VMUWIDHKAIGONP-UHFFFAOYSA-N
- CAS Registry Number: 19596-07-7
- Chemical structure:
View 3d structure (requires JavaScript / HTML 5) - Permanent link for this species. Use this link for bookmarking this species for future reference.

Phase change data

Data compiled by: Robert L. Brown and Stephen E. Stein
Reduced pressure boiling point
Tboil (K) | Pressure (bar) | Reference |
---|---|---|
333. | 0.013 | Farchan Laboratories, 1990 |

References

Farchan Laboratories, 1990
Farchan Laboratories,
Research Chemicals Catalog, Farchan Laboratories, Gainesville, FL, 1990, 91. [all data]