2-Oxetanone, 3,3-dimethyl-
- Formula: C5H8O2
- Molecular weight: 100.1158
- IUPAC Standard InChIKey: ULKFLOVGORAZDI-UHFFFAOYSA-N
- CAS Registry Number: 1955-45-9
- Chemical structure:
View 3d structure (requires JavaScript / HTML 5) - Other names: α,α-Dimethyl-β-propiolactone; α,α-Dimethylpropiolactone; Pivalic acid lactone; Pivalolactone; Propanoic acid, 3-hydroxy-2,2-dimethyl-, β-lactone; 3,3-Dimethyl-β-propiolactone; 3,3-Dimethyl-2-oxetanone; NCI-C04126; Hydracrylic acid, 2,2-dimethyl-, β-lactone; Pivalic acid, hydroxy-, lactone

Phase change data

Data compiled as indicated in comments:
ALS - Hussein Y. Afeefy, Joel F. Liebman, and Stephen E. Stein
DRB - Donald R. Burgess, Jr.
Quantity | Value | Units | Method | Reference | Comment |
---|---|---|---|---|---|
ΔvapH° | 42.43 | kJ/mol | V | Hall, 1969 | ALS |
ΔvapH° | 42.4 | kJ/mol | N/A | Hall, 1969 | DRB |

Gas phase thermochemistry data

Data compiled by: Hussein Y. Afeefy, Joel F. Liebman, and Stephen E. Stein
Quantity | Value | Units | Method | Reference | Comment |
---|---|---|---|---|---|
ΔfH°gas | -352.7 | kJ/mol | Ccr | Hall, 1969 |

References

Hall, 1969
Hall, H.K., Jr.,
The nucleophile-initiated polymerization of α,α-disubstituted β-lactones,
Macromolecules, 1969, 2, 488-496. [all data]