2,2-Dimethyl-3-heptene trans
- Formula: C9H18
- Molecular weight: 126.2392
- IUPAC Standard InChIKey: BQOCYCICSYUPRF-BQYQJAHWSA-N
- CAS Registry Number: 19550-75-5
- Chemical structure:
View 3d structure (requires JavaScript / HTML 5) - Stereoisomers:
- Other names: trans-2,2-Dimethyl-3-heptene; 3-Heptene, 2,2-dimethyl-, (E)-; (E)-2,2-dimethylhept-3-ene

Normal alkane RI, non-polar column, temperature ramp

Column type | Active phase | I | Reference | Comment |
---|---|---|---|---|
Capillary | Petrocol DH | 802. | Supelco, 2012 | 100. m/0.25 mm/0.50 μm, Helium, 20. C @ 15. min, 15. K/min, 220. C @ 30. min |

References

Supelco, 2012
Supelco, CatalogNo. 24160-U,
Petrocol DH Columns. Catalog No. 24160-U, 2012, retrieved from http://www.sigmaaldrich.com/etc/medialib/docs/Supelco/Datasheet/1/w97949.Par.0001.File.tmp/w97949.pdf. [all data]