2,9-Dimethyl-5-decyne
- Formula: C12H22
- Molecular weight: 166.3031
- IUPAC Standard InChIKey: RCFYJIGZQAOTFV-UHFFFAOYSA-N
- CAS Registry Number: 19550-56-2
- Chemical structure:
View 3d structure (requires JavaScript / HTML 5) - Permanent link for this species. Use this link for bookmarking this species for future reference.

Phase change data

Data compiled by: Robert L. Brown and Stephen E. Stein
Reduced pressure boiling point
Tboil (K) | Pressure (bar) | Reference |
---|---|---|
365.0 | 0.025 | Farchan Laboratories, 1990 |

References

Farchan Laboratories, 1990
Farchan Laboratories,
Research Chemicals Catalog, Farchan Laboratories, Gainesville, FL, 1990, 91. [all data]