Cyclopentene, 1,4-dimethyl-

Phase change data

Data compiled by: Thermodynamics Research Center, NIST Boulder Laboratories, Chris Muzny director

Quantity Value Units Method Reference Comment
Tboil366.4KN/ABraun, Spooner, et al., 1950Uncertainty assigned by TRC = 1. K

In addition to the Thermodynamics Research Center (TRC) data available from this site, much more physical and chemical property data is available from the following TRC products:

References

Braun, Spooner, et al., 1950
Braun, W.G.; Spooner, D.F.; Fenske, M.R., Raman spectra hydrocarbons and oxygenated compounds, Anal. Chem., 1950, 22, 1074. [all data]