1,3-Dimethylcyclopentanol
- Formula: C7H14O
- Molecular weight: 114.1855
- IUPAC Standard InChIKey: LLIFEWZQIYEVKX-UHFFFAOYSA-N
- CAS Registry Number: 19550-46-0
- Chemical structure:
View 3d structure (requires JavaScript / HTML 5) - Permanent link for this species. Use this link for bookmarking this species for future reference.

Phase change data

Data compiled by: Thermodynamics Research Center, NIST Boulder Laboratories, Chris Muzny director
Quantity | Value | Units | Method | Reference | Comment |
---|---|---|---|---|---|
Tfus | 254.55 | K | N/A | Timmermans, 1952 | Uncertainty assigned by TRC = 0.4 K |

References

Timmermans, 1952
Timmermans, J.,
Freezing points of organic compounds. VVI New determinations.,
Bull. Soc. Chim. Belg., 1952, 61, 393. [all data]