1-Butanol, 2,3-dimethyl-
- Formula: C6H14O
- Molecular weight: 102.1748
- IUPAC Standard InChIKey: SXSWMAUXEHKFGX-UHFFFAOYSA-N
- CAS Registry Number: 19550-30-2
- Chemical structure:
View 3d structure (requires JavaScript / HTML 5) - Species with the same structure:
- Stereoisomers:
- Other names: 2,3-Dimethyl-1-butanol; 2,3-Methylbutanol; 2,3-Dimethylbutan-1-ol; (dl) 2,3-dimethyl-1-butanol

Gas phase ion energetics data

Data compiled by: John E. Bartmess
De-protonation reactions
C6H13O- + =
By formula: C6H13O- + H+ = C6H14O
Quantity | Value | Units | Method | Reference | Comment |
---|---|---|---|---|---|
ΔrH° | 1560. ± 8.4 | kJ/mol | CIDC | Haas and Harrison, 1993 | gas phase; Both metastable and 50 eV collision energy. |
Quantity | Value | Units | Method | Reference | Comment |
ΔrG° | 1533. ± 8.8 | kJ/mol | H-TS | Haas and Harrison, 1993 | gas phase; Both metastable and 50 eV collision energy. |

Kovats' RI, non-polar column, isothermal

Column type | Active phase | Temperature (C) | I | Reference | Comment |
---|---|---|---|---|---|
Capillary | OV-101 | 80. | 823.9 | Boneva, 1987 | N2; Column length: 100. m; Column diameter: 0.27 mm |
Capillary | OV-101 | 90. | 825.1 | Boneva, 1987 | N2; Column length: 100. m; Column diameter: 0.27 mm |

Kovats' RI, polar column, isothermal

Column type | Active phase | Temperature (C) | I | Reference | Comment |
---|---|---|---|---|---|
Capillary | Carbowax 20M | 80. | 1290. | Boneva, 1987 | N2; Column length: 50. m; Column diameter: 0.23 mm |
Capillary | Carbowax 20M | 90. | 1291. | Boneva, 1987 | N2; Column length: 50. m; Column diameter: 0.23 mm |

Normal alkane RI, non-polar column, temperature ramp

Column type | Active phase | I | Reference | Comment |
---|---|---|---|---|
Capillary | HP-5 | 835.2 | Leffingwell and Alford, 2005 | 60. m/0.32 mm/0.25 μm, He, 30. C @ 2. min, 2. K/min, 260. C @ 28. min |

Phase change data

Data compiled as indicated in comments:
TRC - Thermodynamics Research Center, NIST Boulder Laboratories, Chris Muzny director
AC - William E. Acree, Jr., James S. Chickos
Quantity | Value | Units | Method | Reference | Comment |
---|---|---|---|---|---|
Tboil | 415. ± 10. | K | AVG | N/A | Average of 6 values; Individual data points |
Enthalpy of vaporization
ΔvapH (kJ/mol) | Temperature (K) | Method | Reference | Comment |
---|---|---|---|---|
51.4 | 339. | A | Stephenson and Malanowski, 1987 | Based on data from 324. to 431. K.; AC |
49.6 | 388. | N/A | Wilhoit and Zwolinski, 1973 | Based on data from 373. to 422. K.; AC |

Reaction thermochemistry data

Data compiled by: John E. Bartmess
Individual Reactions
C6H13O- + =
By formula: C6H13O- + H+ = C6H14O
Quantity | Value | Units | Method | Reference | Comment |
---|---|---|---|---|---|
ΔrH° | 1560. ± 8.4 | kJ/mol | CIDC | Haas and Harrison, 1993 | gas phase; Both metastable and 50 eV collision energy. |
Quantity | Value | Units | Method | Reference | Comment |
ΔrG° | 1533. ± 8.8 | kJ/mol | H-TS | Haas and Harrison, 1993 | gas phase; Both metastable and 50 eV collision energy. |

References

Haas and Harrison, 1993
Haas, M.J.; Harrison, A.G.,
The Fragmentation of Proton-Bound Cluster Ions and the Gas-Phase Acidities of Alcohols,
Int. J. Mass Spectrom. Ion Proc., 1993, 124, 2, 115, https://doi.org/10.1016/0168-1176(93)80003-W
. [all data]
Boneva, 1987
Boneva, S.,
Gas Chromatographic Retention Indices for C6 Alkanols on OV-101 and Carbowax 20M Capillary Columns,
Chromatographia, 1987, 23, 1, 50-52, https://doi.org/10.1007/BF02310419
. [all data]
Leffingwell and Alford, 2005
Leffingwell, J.C.; Alford, E.D.,
Volatile constituents of Perique tobacco,
Electron. J. Environ. Agric. Food Chem., 2005, 4, 2, 899-915. [all data]