3-Hexanol, 2,5-dimethyl-
- Formula: C8H18O
- Molecular weight: 130.2279
- IUPAC Standard InChIKey: SNKTZHPOKPYBPT-UHFFFAOYSA-N
- CAS Registry Number: 19550-07-3
- Chemical structure:
View 3d structure (requires JavaScript / HTML 5) - Other names: 2,5-Dimethyl-3-hexanol; 2,5-dimethylhexan-3-ol

Phase change data

Data compiled as indicated in comments:
TRC - Thermodynamics Research Center, NIST Boulder Laboratories, Chris Muzny director
AC - William E. Acree, Jr., James S. Chickos
Quantity | Value | Units | Method | Reference | Comment |
---|---|---|---|---|---|
Tboil | 431. ± 5. | K | AVG | N/A | Average of 7 values; Individual data points |
Enthalpy of vaporization
ΔvapH (kJ/mol) | Temperature (K) | Reference | Comment |
---|---|---|---|
55. | 352. | Wilhoit and Zwolinski, 1973 | Based on data from 337. to 431. K.; AC |

References

Wilhoit and Zwolinski, 1973
Wilhoit, R.C.; Zwolinski, B.J.,
Physical and thermodynamic properties of aliphatic alcohols,
J. Phys. Chem. Ref. Data Suppl., 1973, 1, 2, 1. [all data]