2-Hexanol, 2,3-dimethyl-
- Formula: C8H18O
- Molecular weight: 130.2279
- IUPAC Standard InChIKey: BFKOEFFCVFMWPF-UHFFFAOYSA-N
- CAS Registry Number: 19550-03-9
- Chemical structure:
View 3d structure (requires JavaScript / HTML 5) - Other names: 2,3-Dimethyl-2-hexanol

Phase change data

Data compiled by: Thermodynamics Research Center, NIST Boulder Laboratories, Chris Muzny director
Quantity | Value | Units | Method | Reference | Comment |
---|---|---|---|---|---|
Tboil | 424.15 | K | N/A | Wibaut, Hoog, et al., 1939 | Uncertainty assigned by TRC = 2. K |

References

Wibaut, Hoog, et al., 1939
Wibaut, J.P.; Hoog, H.; Langedijk, S.L.; Overhoff, J.; Smittenberg, J.; Benninga, N.; Bouman, G.P.; van Dijk, H.; Gaade, W.; Geldof, H.; Hackmann, J.Th.; Jonker, E.W.; Paap, T.; Zuiderweg, F.J.,
Study on the Preparation and the Physical Constants of A Number of Alkanes and Cycloalkanes,
Recl. Trav. Chim. Pays-Bas, 1939, 58, 329. [all data]