3,6-Dimethyl-1-heptyn-3-ol
- Formula: C9H16O
- Molecular weight: 140.2227
- IUPAC Standard InChIKey: COWFALGRNJAHKW-UHFFFAOYSA-N
- CAS Registry Number: 19549-98-5
- Chemical structure:
View 3d structure (requires JavaScript / HTML 5) - Other names: 1-Heptyn-3-ol, 3,6-dimethyl-

Phase change data

Data compiled by: Robert L. Brown and Stephen E. Stein
Reduced pressure boiling point
Tboil (K) | Pressure (bar) | Reference |
---|---|---|
332. to 333. | 0.007 | Farchan Laboratories, 1990 |

References

Farchan Laboratories, 1990
Farchan Laboratories,
Research Chemicals Catalog, Farchan Laboratories, Gainesville, FL, 1990, 91. [all data]