2,6-dimethyl-3-heptyne
- Formula: C9H16
- Molecular weight: 124.2233
- IUPAC Standard InChIKey: PDZCESXHZWBABW-UHFFFAOYSA-N
- CAS Registry Number: 19549-97-4
- Chemical structure:
View 3d structure (requires JavaScript / HTML 5) - Permanent link for this species. Use this link for bookmarking this species for future reference.

Phase change data

Data compiled by: Thermodynamics Research Center, NIST Boulder Laboratories, Chris Muzny director
Quantity | Value | Units | Method | Reference | Comment |
---|---|---|---|---|---|
Tboil | 406. | K | N/A | Petrov, Verentsova, et al., 1941 | Uncertainty assigned by TRC = 5. K |
Tboil | 406. | K | N/A | Petrov and Azatyan, 1940 | Uncertainty assigned by TRC = 6. K |

References

Petrov, Verentsova, et al., 1941
Petrov, A.D.; Verentsova, N.I.; Kokleeva, T.A.,
Synthesis of 2-Methyl-4-hexyne and 2,5-Dimethyl-3-heptyne,
Zh. Obshch. Khim., 1941, 11, 1096. [all data]
Petrov and Azatyan, 1940
Petrov, A.D.; Azatyan, V.D.,
Usp. Khim., 1940, 9, 498. [all data]