3-Heptanone, 2,6-dimethyl-
- Formula: C9H18O
- Molecular weight: 142.2386
- IUPAC Standard InChIKey: HFNWDYQEGABWQS-UHFFFAOYSA-N
- CAS Registry Number: 19549-83-8
- Chemical structure:
View 3d structure (requires JavaScript / HTML 5) - Other names: 2,6-Dimethyl-3-heptanone; 2,6-dimethylheptan-3-one

Phase change data

Data compiled by: Thermodynamics Research Center, NIST Boulder Laboratories, Chris Muzny director
Quantity | Value | Units | Method | Reference | Comment |
---|---|---|---|---|---|
Tboil | 445. | K | N/A | Blaise, 1901 | Uncertainty assigned by TRC = 4. K |

Normal alkane RI, non-polar column, temperature ramp

View large format table.

Column type Active phase I Reference Comment
CapillaryDB-5985.Dhanda, Pegg, et al., 200360. m/0.25 mm/0.25 μm, He, 35. C @ 2. min, 5. K/min, 280. C @ 4. min

References

Blaise, 1901
Blaise, E.E.,
C. R. Hebd. Seances Acad. Sci., 1901, 132, 478. [all data]