3-Heptanol, 2,4-dimethyl-
- Formula: C9H20O
- Molecular weight: 144.2545
- IUPAC Standard InChIKey: PSCLFHNWSAXNJL-UHFFFAOYSA-N
- CAS Registry Number: 19549-72-5
- Chemical structure:
View 3d structure (requires JavaScript / HTML 5) - Other names: 2,4-Dimethyl-3-heptanol

Normal alkane RI, polar column, temperature ramp

Column type | Active phase | I | Reference | Comment |
---|---|---|---|---|
Capillary | DB-Wax | 1363. | Souza, Re-Poppi, et al., 2012 | 30. m/0.25 mm/0.25 μm, Helium, 60. C @ 1. min, 5. K/min; Tend: 240. C |

References

Souza, Re-Poppi, et al., 2012
Souza, J.B.G.; Re-Poppi, N.; Raposo, J.L.(Jr).,
Characterization of pyroligneous acid used in agriculture by gas chromatography - mass spectrometry (in press),
J. Braz. Chem. Soc., 2012, 00, 00, 1-8. [all data]