1,2-dichlorocyclopropane
- Formula: C3H4Cl2
- Molecular weight: 110.970
- IUPAC Standard InChIKey: YYQKBUMQNFGUGI-UHFFFAOYSA-N
- CAS Registry Number: 19533-47-2
- Chemical structure:
View 3d structure (requires JavaScript / HTML 5) - Stereoisomers:

Phase change data

Data compiled by: Thermodynamics Research Center, NIST Boulder Laboratories, Chris Muzny director
Quantity | Value | Units | Method | Reference | Comment |
---|---|---|---|---|---|
Tfus | 253.7 | K | N/A | Stevens, 1946 | Uncertainty assigned by TRC = 3. K |

References

Stevens, 1946
Stevens, P.G.,
Some New Cyclopropanes with A Note on the Exterior Valence Angles of Cyclopropane,
J. Am. Chem. Soc., 1946, 68, 620-2. [all data]