tetrakis(1,1,1,5,5,5-hexafluoro-2,4-pentanedionato)zirconium(IV)

Phase change data

Data compiled by: William E. Acree, Jr., James S. Chickos

Enthalpy of vaporization

ΔvapH (kJ/mol) Temperature (K) Method Reference Comment
48.6 ± 0.6411.TMorozova, Sysoev, et al., 1996Based on data from 366. - 456. K.

Enthalpy of sublimation

ΔsubH (kJ/mol) Temperature (K) Method Reference
59.0333. - 363.TGAFahlman and Barron, 2000

References

Morozova, Sysoev, et al., 1996
Morozova, N.B.; Sysoev, S.V.; Igumenov, I.K.; Golubenko, A.N., Study of temperature dependence of saturated vapour pressure of zirconium(IV) β-diketonates, Journal of Thermal Analysis, 1996, 46, 5, 1367-1373, https://doi.org/10.1007/BF01979249 . [all data]

Fahlman and Barron, 2000
Fahlman, Bradley D.; Barron, Andrew R., Substituent effects on the volatility of metal ?-diketonates, Adv. Mater. Opt. Electron., 2000, 10, 3-5, 223-232, https://doi.org/10.1002/1099-0712(200005/10)10:3/5<223::AID-AMO411>3.0.CO;2-M . [all data]