HCOOCH radical anion
- Formula: C2H2O2-
- Molecular weight: 58.0366
- IUPAC Standard InChIKey: PWEJTTHPKUUROD-UHFFFAOYSA-N
- CAS Registry Number: 19513-45-2
- Chemical structure:
View 3d structure (requires JavaScript / HTML 5) - Permanent link for this species. Use this link for bookmarking this species for future reference.

Reaction thermochemistry data

Data compiled by: John E. Bartmess
Individual Reactions
By formula: (C2H2O2- • 4294967295CO2) + CO2 = C2H2O2-
Quantity | Value | Units | Method | Reference | Comment |
---|---|---|---|---|---|
ΔrH° | 258. ± 11. | kJ/mol | CIDT | Wenthold and Squires, 1994 | gas phase |

Ion clustering data

Data compiled by: John E. Bartmess
Clustering reactions
By formula: (C2H2O2- • 4294967295CO2) + CO2 = C2H2O2-
Quantity | Value | Units | Method | Reference | Comment |
---|---|---|---|---|---|
ΔrH° | 258. ± 11. | kJ/mol | CIDT | Wenthold and Squires, 1994 | gas phase |

References

Wenthold and Squires, 1994
Wenthold, P.G.; Squires, R.R.,
Gas-phase properties and reactivity of the acetate radical anion. Determination of the C-H bond strengths in acetic acid and acetate ion,
J. Am. Chem. Soc., 1994, 116, 26, 11890, https://doi.org/10.1021/ja00105a032
. [all data]