Acetic acid, methoxy-, anhydride
- Formula: C6H10O5
- Molecular weight: 162.1406
- IUPAC Standard InChIKey: PEHFQQWAINXOQG-UHFFFAOYSA-N
- CAS Registry Number: 19500-95-9
- Chemical structure:
View 3d structure (requires JavaScript / HTML 5) - Other names: Methoxyacetic acid anhydride; Methoxyacetic anhydride

Reaction thermochemistry data

Data compiled by: Hussein Y. Afeefy, Joel F. Liebman, and Stephen E. Stein
Individual Reactions
By formula: C4H6O3 + 2C3H6O3 = C6H10O5 + 2C2H4O2
Quantity | Value | Units | Method | Reference | Comment |
---|---|---|---|---|---|
ΔrH° | 0.0 | kJ/mol | Eqk | Utkin, Bogel'fer, et al., 1991 | liquid phase; NMR |

References

Utkin, Bogel'fer, et al., 1991
Utkin, A.Yu.; Bogel'fer, L.Ya.; Chimishkyan, A.L.,
Reversible reactions in the acidolysis of methyoxyacetic acid by acetic anhydride,
Russ. J. Phys. Chem. (Engl. Transl.), 1991, 65, 1049-1059, In original 1974. [all data]