Copper anion
- Formula: Cu-
- Molecular weight: 63.547
- CAS Registry Number: 19498-52-3

Gas phase thermochemistry data

Data compiled as indicated in comments:
B - John E. Bartmess
Quantity | Value | Units | Method | Reference | Comment |
---|---|---|---|---|---|
ΔfH°gas | 52.4 ± 3.7 | kcal/mol | Acid | Bilodeau, Scheer, et al., 1998 | B |
Quantity | Value | Units | Method | Reference | Comment |
S°gas,1 bar | 38.391 | cal/mol*K | Review | Chase, 1998 | Data last reviewed in September, 1984 |

Reaction thermochemistry data

Data compiled by: John E. Bartmess
Individual Reactions
Quantity | Value | Units | Method | Reference | Comment |
---|---|---|---|---|---|
ΔrH° | 346.8 ± 2.6 | kcal/mol | D-EA | Bilodeau, Scheer, et al., 1998 | gas phase |
ΔrH° | 346.8 ± 2.6 | kcal/mol | D-EA | Leopold, Ho, et al., 1987 | gas phase |

Gas phase ion energetics data

Data compiled by: John E. Bartmess
Protonation reactions
Quantity | Value | Units | Method | Reference | Comment |
---|---|---|---|---|---|
ΔrH° | 346.8 ± 2.6 | kcal/mol | D-EA | Bilodeau, Scheer, et al., 1998 | gas phase |
ΔrH° | 346.8 ± 2.6 | kcal/mol | D-EA | Leopold, Ho, et al., 1987 | gas phase |

References

Bilodeau, Scheer, et al., 1998
Bilodeau, R.C.; Scheer, M.; Haugen, H.K.,
Infrared Laser Photodetachment of Transition Metal Negative Ions: Studies on Cr-, Mo-, Cu-, and Ag-,
J. Phys. B: Atom. Mol. Opt. Phys., 1998, 31, 17, 3885-3891, https://doi.org/10.1088/0953-4075/31/17/013
. [all data]
Chase, 1998
Chase, M.W., Jr.,
NIST-JANAF Themochemical Tables, Fourth Edition,
J. Phys. Chem. Ref. Data, Monograph 9, 1998, 1-1951. [all data]
Leopold, Ho, et al., 1987
Leopold, D.G.; Ho, J.; Lineberger, W.C.,
Photoelectron Spectroscopy of Mass-selected Metal Cluster Anions. I. Cun-, n=1-10,
J. Chem. Phys., 1987, 86, 4, 1715, https://doi.org/10.1063/1.452170
. [all data]