(R*,S*)-2,3-dichloropentane
- Formula: C5H10Cl2
- Molecular weight: 141.039
- IUPAC Standard InChIKey: HVFJQRZGBBKTPL-UHNVWZDZSA-N
- CAS Registry Number: 19489-99-7
- Chemical structure:
View 3d structure (requires JavaScript / HTML 5) - Stereoisomers:

Phase change data

Data compiled by: Thermodynamics Research Center, NIST Boulder Laboratories, Chris Muzny director
Quantity | Value | Units | Method | Reference | Comment |
---|---|---|---|---|---|
Tboil | 139.0 | K | N/A | Hoff, Greenlee, et al., 1951 | Uncertainty assigned by TRC = 0.5 K |
Quantity | Value | Units | Method | Reference | Comment |
Tfus | 195.33 | K | N/A | Hoff, Greenlee, et al., 1951 | Uncertainty assigned by TRC = 0.5 K |
Tfus | 195.80 | K | N/A | Hoff, Greenlee, et al., 1951 | Uncertainty assigned by TRC = 0.2 K |

References

Hoff, Greenlee, et al., 1951
Hoff, M.C.; Greenlee, K.W.; Boord, C.E.,
The Quantitavitve Inversion of cis- and trans-Alkene Isomers: A New Synthesis of Normal cis-Alkenes,
J. Am. Chem. Soc., 1951, 73, 3329-36. [all data]