Dinaphtho[2,1-b:1',2'-d]thiophene
- Formula: C20H12S
- Molecular weight: 284.374
- IUPAC Standard InChIKey: JFNCOYXPHARAMI-UHFFFAOYSA-N
- CAS Registry Number: 194-65-0
- Chemical structure:
View 3d structure (requires JavaScript / HTML 5) - Other names: Naphtho(2,1-b)naphtho(1,2-d)thiophene; Dinaphtho[2,1-b;1',2-d]thiophene

Lee's RI, non-polar column, temperature ramp

Column type | Active phase | I | Reference | Comment |
---|---|---|---|---|
Capillary | DB-5 | 470.0 | Becker and Colmsjö, 1998 | 30. m/0.25 mm/0.25 μm, He, 110. C @ 1. min, 10. K/min, 325. C @ 5. min |
Capillary | SE-52 | 472.62 | Vassilaros, Kong, et al., 1982 | 20. m/0.30 mm/0.25 μm, H2, 40. C @ 2. min, 4. K/min; Tend: 265. C |

Lee's RI, non-polar column, custom temperature program

Column type | Active phase | I | Reference | Comment |
---|---|---|---|---|
Capillary | DB-5 | 461.2 | Becker and Colmsjö, 1998 | 30. m/0.25 mm/0.25 μm, He; Program: 110C(1min) => 40C/min => 160C => 10C/min => 300C925min) |

References

Becker and Colmsjö, 1998
Becker, G.; Colmsjö, A.,
Gas chromatography-atomic emission detection for quantification of polycyclic aromatic sulfur heterocycles,
Anal. Chim. Acta., 1998, 376, 3, 265-272, https://doi.org/10.1016/S0003-2670(98)00546-7
. [all data]
Vassilaros, Kong, et al., 1982
Vassilaros, D.L.; Kong, R.C.; Later, D.W.; Lee, M.L.,
Linear retention index system for polycyclic aromatic compounds. Critical evaluation and additional indices,
J. Chromatogr., 1982, 252, 1-20, https://doi.org/10.1016/S0021-9673(01)88394-1
. [all data]