4-Methylphthalic anhydride
- Formula: C9H6O3
- Molecular weight: 162.1421
- IUPAC Standard InChIKey: ZOXBWJMCXHTKNU-UHFFFAOYSA-N
- CAS Registry Number: 19438-61-0
- Chemical structure:
View 3d structure (requires JavaScript / HTML 5) - Other names: 1,3-Isobenzofurandione, 5-methyl-

Gas phase ion energetics data

Data compiled by: John E. Bartmess
Electron affinity determinations
EA (eV) | Method | Reference | Comment |
---|---|---|---|
1.188 ± 0.087 | IMRE | Paul and Kebarle, 1989 | ΔGea(423 K) = -26.1±1 kcal/mol, ΔS(est) = -3 eu |

References

Paul and Kebarle, 1989
Paul, G.; Kebarle, P.,
Electron Affinities of Cyclic Unsaturated Dicarbonyls: Maleic Anhydrides, Maleimides, and Cyclopentendione,
J. Am. Chem. Soc., 1989, 111, 2, 464, https://doi.org/10.1021/ja00184a009
. [all data]