Methyl 2-thienylacetate
- Formula: C7H8O2S
- Molecular weight: 156.202
- IUPAC Standard InChIKey: KNKIXYMOHMYZJR-UHFFFAOYSA-N
- CAS Registry Number: 19432-68-9
- Chemical structure:
View 3d structure (requires JavaScript / HTML 5) - Other names: 2-Thiopheneacetic acid, methyl ester; Methyl thiophene-2-acetate; methyl thiophen-2-acetate; Methyl 2-thiopheneacetate

Phase change data

Data compiled by: William E. Acree, Jr., James S. Chickos
Quantity | Value | Units | Method | Reference | Comment |
---|---|---|---|---|---|
ΔvapH° | 61.9 ± 1.4 | kJ/mol | C | Roux, Temprado, et al., 2007 |

References

Roux, Temprado, et al., 2007
Roux, María Victoria; Temprado, Manuel; Notario, Rafael; Chickos, James S.; Santos, Ana Filipa L.O.M.; Ribeiro da Silva, Manuel A.V.,
Experimental and Computational Thermochemical Study of 2- and 3-Thiopheneacetic Acid Methyl Esters,
J. Phys. Chem. A, 2007, 111, 24, 5280-5286, https://doi.org/10.1021/jp0720901
. [all data]