N,N'-Didecylurea

Condensed phase thermochemistry data

Data compiled by: Hussein Y. Afeefy, Joel F. Liebman, and Stephen E. Stein

Quantity Value Units Method Reference Comment
Δfsolid-877.4 ± 7.1kJ/molCcbVenugopala Charlu and Rao, 1964Reanalyzed by Cox and Pilcher, 1970, Original value = -876.1 kJ/mol
Quantity Value Units Method Reference Comment
Δcsolid-13674.6 ± 7.1kJ/molCcbVenugopala Charlu and Rao, 1964Reanalyzed by Cox and Pilcher, 1970, Original value = -13675. ± 7.1 kJ/mol

References

Venugopala Charlu and Rao, 1964
Venugopala Charlu, T.; Rao, M.R.A., Heats of combustion of some symmetrical dialkyl ureas and their corresponding alkyl carbamates, Proc. Indian Acad. Sci. Sect. A, 1964, 60, 31-35. [all data]

Cox and Pilcher, 1970
Cox, J.D.; Pilcher, G., Thermochemistry of Organic and Organometallic Compounds, Academic Press, New York, 1970, 1-636. [all data]