4aα,4bβ-Gibbane-1α,10β-dicarboxylic acid, 4a-formyl-1-methyl-8-methylene-, dimethyl ester

Van Den Dool and Kratz RI, non-polar column, custom temperature program

Data compiled by: NIST Mass Spectrometry Data Center, William E. Wallace, director

Column type CapillaryCapillaryCapillary
Active phase HP-1HP-1DB-1
Column length (m) 30.30.15.
Carrier gas HeHe
Substrate
Column diameter (mm) 0.250.250.22
Phase thickness (μm) 0.250.250.25
Program 60C (1min) => 15C/min => 200C => 5C/min => 285C60C (1min) => 15C/min => 200C => 5C/min => 285C60(0.1 min)-200 0C at 20 deg/min; 200-300 0C at 5 deg/min
I 2444.2444.2469.
ReferenceKim, Lee, et al., 2003Kim, Lee, et al., 2003Pearce, Koshioka, et al., 1994
Comment MSDC-RI MSDC-RI MSDC-RI

References

Kim, Lee, et al., 2003
Kim, S.-K.; Lee, S.-C.; Shin, D.-H.; Jang, S.-W.; Nam, J.-W.; Park, T.-S.; Lee, I.-J., Quantification of endogenous gibberellins in leaves and tubers of Chinese yam, Dioscorea opposita Thunb. cv. Tsukune during tuber enlargement, Plant Growth Regul., 2003, 39, 2, 125-130, https://doi.org/10.1023/A:1022569506883 . [all data]

Pearce, Koshioka, et al., 1994
Pearce, D.W.; Koshioka, M.; Pharis, R.P., Chromatography of gibberellins, J. Chromatogr. A, 1994, 658, 1, 91-122, https://doi.org/10.1016/0021-9673(94)85210-3 . [all data]