tetrabutylammonium nitrate

Phase change data

Data compiled by: Thermodynamics Research Center, NIST Boulder Laboratories, Chris Muzny director

Quantity Value Units Method Reference Comment
Tfus392.2KN/ACoker, Ambrose, et al., 1970Crystal phase 1 phase; Uncertainty assigned by TRC = 0.5 K

In addition to the Thermodynamics Research Center (TRC) data available from this site, much more physical and chemical property data is available from the following TRC products:

References

Coker, Ambrose, et al., 1970
Coker, T.G.; Ambrose, J.; Janz, G.J., Fusion properties of some ionic quaternary ammonium compounds., J. Am. Chem. Soc., 1970, 92, 5293. [all data]