Dihydrocapsaicin
- Formula: C18H29NO3
- Molecular weight: 307.4278
- IUPAC Standard InChIKey: XJQPQKLURWNAAH-UHFFFAOYSA-N
- CAS Registry Number: 19408-84-5
- Chemical structure:

Van Den Dool and Kratz RI, non-polar column, custom temperature program

Column type | Active phase | I | Reference | Comment |
---|---|---|---|---|
Capillary | HP-5MS | 2616.1 | Andriamaharavo, 2014 | 30. m/0.25 mm/0.25 μm, He; Program: 60C (1 min) => 5 C/min => 210C => 10 C/min => 280C (15 min) |
Capillary | VF-5MS | 2607.1 | Tret'yakov, 2008 | 30. m/0.25 mm/0.25 μm, He; Program: Multi-step temperature program; T(initial)=60C; T(final)=270C |

References

Andriamaharavo, 2014
Andriamaharavo, N.R.,
Retention Data. NIST Mass Spectrometry Data Center., NIST Mass Spectrometry Data Center, 2014. [all data]
Tret'yakov, 2008
Tret'yakov, K.V.,
Retention Data. NIST Mass Spectrometry Data Center., NIST Mass Spectrometry Data Center, 2008. [all data]