p-Toluidine, 3,5-dinitro-
- Formula: C7H7N3O4
- Molecular weight: 197.1482
- IUPAC Standard InChIKey: KQRJATLINVYHEZ-UHFFFAOYSA-N
- CAS Registry Number: 19406-51-0
- Chemical structure:
View 3d structure (requires JavaScript / HTML 5) - Other names: Benzenamine, 4-methyl-3,5-dinitro-; 2,6-Dinitro-4-aminotoluene; 3,5-Dinitro-4-methylaniline; 4-Amino-2,6-dinitrotoluene; 4-ADNT; 4-Methyl-3,5-dinitrobenzenamine; 4-Methyl-3,5-dinitrophenylamine; 3,5-Dinitro-p-toluidine; NSC 25010

Lee's RI, non-polar column, temperature ramp

Column type | Active phase | I | Reference | Comment |
---|---|---|---|---|
Capillary | DB-5MS | 321.91 | Chen, Keeran, et al., 2002 | 30. m/0.25 mm/0.5 μm, 40. C @ 1. min, 10. K/min; Tend: 310. C |

References

Chen, Keeran, et al., 2002
Chen, P.H.; Keeran, W.S.; Van Ausdale, W.A.; Schindler, D.R.; Roberts, D.W.,
Application of Lee retention indices to the confirmation of tentatively identified compounds from GC/MS analysis of environmental samples, Technical paper, Analytical Services Division, Environmental ScienceEngineering, Inc, PO Box 1703, Gainesville, FL 32602, 2002, 11. [all data]