4-Azapyrene
- Formula: C15H9N
- Molecular weight: 203.2387
- IUPAC Standard InChIKey: YEELFSTYCPPLQY-UHFFFAOYSA-N
- CAS Registry Number: 194-03-6
- Chemical structure:
View 3d structure (requires JavaScript / HTML 5) - Other names: Benzo(lmn)phenanthridine; Pyrenidine; Thebenidin-; Benzo[l.m.n]phenanthridine; Thebenidine-; 5-Azapyrene

Lee's RI, non-polar column, temperature ramp

Column type | Active phase | I | Reference | Comment |
---|---|---|---|---|
Capillary | SE-52 | 358.76 | Hasegawa, Usami, et al., 1990 | 2. K/min; Column length: 12. m; Column diameter: 0.25 mm; Tstart: 50. C; Tend: 270. C |
Capillary | SE-52 | 361.20 | Hasegawa, Usami, et al., 1990 | 2. K/min; Column length: 12. m; Column diameter: 0.25 mm; Tstart: 50. C; Tend: 270. C |
Capillary | SE-52 | 357.94 | Vassilaros, Kong, et al., 1982 | 20. m/0.30 mm/0.25 μm, H2, 40. C @ 2. min, 4. K/min; Tend: 265. C |
Capillary | SE-52 | 358.53 | Lee, Vassilaros, et al., 1979 | 12. m/0.3 mm/0.34 μm, He, 2. K/min; Tstart: 50. C; Tend: 250. C |

Lee's RI, non-polar column, custom temperature program

Column type | Active phase | I | Reference | Comment |
---|---|---|---|---|
Capillary | SE-54 | 356.93 | Guillen, Iglesias, et al., 1992 | Program: not specified |
Capillary | SE-52 | 357.94 | Hasegawa, Usami, et al., 1990 | Column length: 12. m; Column diameter: 0.25 mm; Program: not specified |
Capillary | SE-52 | 361.78 | Hasegawa, Usami, et al., 1990 | Column length: 12. m; Column diameter: 0.25 mm; Program: not specified |

References

Hasegawa, Usami, et al., 1990
Hasegawa, K.; Usami, S.; Higashide, A.,
Analysis of amino polycyclic aromatic hydrocarbons and polycyclic aromatic nitrogen heterocycles,
Nippon Kagaku Kaishi, 1990, 7, 777-788, https://doi.org/10.1246/nikkashi.1990.777
. [all data]
Vassilaros, Kong, et al., 1982
Vassilaros, D.L.; Kong, R.C.; Later, D.W.; Lee, M.L.,
Linear retention index system for polycyclic aromatic compounds. Critical evaluation and additional indices,
J. Chromatogr., 1982, 252, 1-20, https://doi.org/10.1016/S0021-9673(01)88394-1
. [all data]
Lee, Vassilaros, et al., 1979
Lee, M.L.; Vassilaros, D.L.; White, C.M.; Novotny, M.,
Retention Indices for Programmed-Temperature Capillary-Column Gas Chromatography of Polycyclic Aromatic Hydrocarbons,
Anal. Chem., 1979, 51, 6, 768-773, https://doi.org/10.1021/ac50042a043
. [all data]
Guillen, Iglesias, et al., 1992
Guillen, M.D.; Iglesias, M.J.; Dominguez, A.; Blanco, C.G.,
Polynuclear aromatic hydrocarbon retention indices on SE-54 stationary phase of the volatile components of a coal tar pitch. Relationships between chromatographic retention and thermal reactivity,
J. Chromatogr., 1992, 591, 1-2, 287-295, https://doi.org/10.1016/0021-9673(92)80246-Q
. [all data]