cis-3-Decene
- Formula: C10H20
- Molecular weight: 140.2658
- IUPAC Standard InChIKey: GVRWIAHBVAYKIZ-ALCCZGGFSA-N
- CAS Registry Number: 19398-86-8
- Chemical structure:
View 3d structure (requires JavaScript / HTML 5) - Stereoisomers:
- Other names: (Z)-3-C10H20; 3-Decene, (Z)-; (3Z)-3-Decene; (Z)-3-Decene

Kovats' RI, non-polar column, isothermal

Column type | Active phase | Temperature (C) | I | Reference | Comment |
---|---|---|---|---|---|
Capillary | Squalane | 100. | 986. | Heinzen, Soares, et al., 1999 | |
Capillary | OV-101 | 40. | 995. | Laub and Purnell, 1988 | |
Capillary | OV-101 | 60. | 995. | Laub and Purnell, 1988 | |
Capillary | OV-101 | 80. | 996. | Laub and Purnell, 1988 | |
Capillary | OV-101 | 110. | 997. | Rang, Kuningas, et al., 1987 | He; Column length: 50. m; Column diameter: 0.25 mm |
Capillary | Squalane | 100. | 986. | Sojak, Hrivnak, et al., 1973 | |
Capillary | Squalane | 115. | 986. | Sojak, Hrivnak, et al., 1973 | |
Capillary | Squalane | 86. | 985. | Sojak, Hrivnak, et al., 1973 | |
Capillary | Apiezon L | 100. | 991.1 | Eisen, Orav, et al., 1972 | Column length: 45. m; Column diameter: 0.25 mm |
Capillary | Apiezon L | 120. | 992.8 | Eisen, Orav, et al., 1972 | Column length: 45. m; Column diameter: 0.25 mm |
Capillary | Squalane | 115. | 986.4 | Soják and Bucinská, 1970 | N2; Column length: 200. m; Column diameter: 0.2 mm |
Capillary | Squalane | 86. | 985.4 | Soják and Bucinská, 1970 | N2; Column length: 200. m; Column diameter: 0.2 mm |

Kovats' RI, polar column, isothermal

Column type | Active phase | Temperature (C) | I | Reference | Comment |
---|---|---|---|---|---|
Capillary | PEG 4000 | 100. | 1054. | Rang, Orav, et al., 1988 | |
Capillary | PEG 4000 | 110. | 1055. | Rang, Orav, et al., 1988 | |
Capillary | PEG 4000 | 120. | 1057. | Rang, Orav, et al., 1988 | |
Capillary | PEG 4000 | 70. | 1049. | Rang, Orav, et al., 1988 | |
Capillary | PEG 4000 | 80. | 1052. | Rang, Orav, et al., 1988 | |
Capillary | PEG-20M | 100. | 1049. | Rang, Orav, et al., 1988 | |
Capillary | PEG-20M | 110. | 1050. | Rang, Orav, et al., 1988 | |
Capillary | PEG-20M | 90. | 1048. | Rang, Orav, et al., 1988 | |
Capillary | Polyethylene Glycol 4000 | 100. | 1053.9 | Eisen, Orav, et al., 1972 | Column length: 80. m; Column diameter: 0.25 mm |
Capillary | Polyethylene Glycol 4000 | 120. | 1056.6 | Eisen, Orav, et al., 1972 | Column length: 80. m; Column diameter: 0.25 mm |
Capillary | Polyethylene Glycol 4000 | 70. | 1049.3 | Eisen, Orav, et al., 1972 | Column length: 80. m; Column diameter: 0.25 mm |
Capillary | Polyethylene Glycol 4000 | 80. | 1051.9 | Eisen, Orav, et al., 1972 | Column length: 80. m; Column diameter: 0.25 mm |
Capillary | PEG 4000 | 100. | 1053.9 | Orav and Eisen, 1972 | Column length: 80. m; Column diameter: 0.25 mm |
Capillary | PEG 4000 | 120. | 1056.6 | Orav and Eisen, 1972 | Column length: 80. m; Column diameter: 0.25 mm |
Capillary | PEG 4000 | 70. | 1049.5 | Orav and Eisen, 1972 | Column length: 80. m; Column diameter: 0.25 mm |
Capillary | PEG 4000 | 80. | 1051.9 | Orav and Eisen, 1972 | Column length: 80. m; Column diameter: 0.25 mm |

Kovats' RI, polar column, temperature ramp

Column type | Active phase | I | Reference | Comment |
---|---|---|---|---|
Capillary | DB-Wax | 1049. | Umano and Shibamoto, 1987 | He, 40. C @ 10. min, 2. K/min; Column length: 60. m; Column diameter: 0.25 mm; Tend: 200. C |

Van Den Dool and Kratz RI, non-polar column, temperature ramp

Column type | Active phase | I | Reference | Comment |
---|---|---|---|---|
Capillary | Petrocol DH | 995. | White, Hackett, et al., 1992 | 100. m/0.25 mm/0.5 μm, He, 1. K/min; Tstart: 30. C; Tend: 220. C |

Normal alkane RI, non-polar column, temperature ramp

Column type | Active phase | I | Reference | Comment |
---|---|---|---|---|
Capillary | OV-101 | 993. | Orav, Kailas, et al., 1999 | 50. m/0.20 mm/0.50 μm, Helium, 30. C @ 6. min, 1. K/min; Tend: 100. C |

Normal alkane RI, non-polar column, custom temperature program

Column type | Active phase | I | Reference | Comment |
---|---|---|---|---|
Capillary | Polydimethyl siloxane | 986. | Junkes, Castanho, et al., 2003 | Program: not specified |

Gas phase ion energetics data

Data compiled as indicated in comments:
LLK - Sharon G. Lias, Rhoda D. Levin, and Sherif A. Kafafi
Ionization energy determinations
IE (eV) | Method | Reference | Comment |
---|---|---|---|
8.832 ± 0.009 | PI | Rang, Martinson, et al., 1974 | LLK |
9.01 ± 0.01 | PE | Krause, Taylor, et al., 1978 | Vertical value; LLK |

References

Heinzen, Soares, et al., 1999
Heinzen, V.E.F.; Soares, M.F.; Yunes, R.A.,
Semi-empirical topological method for the prediction of the chromatographic retention of cis- and trans-alkene isomers and alkanes,
J. Chromatogr. A, 1999, 849, 2, 495-506, https://doi.org/10.1016/S0021-9673(99)00530-0
. [all data]
Laub and Purnell, 1988
Laub, R.J.; Purnell, J.H.,
Specific retention volumes, retention indices, and family-plot regressions of aliphatic, alicyclic, and aromatic hydrocarbon solutes with OV-101 poly (dimethylsiloxane) stationary phase,
J. Hi. Res. Chromatogr. Chromatogr. Comm., 1988, 11, 9, 649-660, https://doi.org/10.1002/jhrc.1240110908
. [all data]
Rang, Kuningas, et al., 1987
Rang, S.; Kuningas, K.; Strenze, T.; Orav, A.; Eisen, O.,
Retention and Thermodynamics of Solution of n-Alkenes in OV-101,
J. Chromatogr., 1987, 406, 75-80, https://doi.org/10.1016/S0021-9673(00)94018-4
. [all data]
Sojak, Hrivnak, et al., 1973
Sojak, L.; Hrivnak, J.; Majer, P.; Janak, J.,
Capillary Gas Chromatography of Linear Alkenes on Squalane,
Anal. Chem., 1973, 45, 2, 293-302, https://doi.org/10.1021/ac60324a039
. [all data]
Eisen, Orav, et al., 1972
Eisen, O.; Orav, A.; Rang, S.,
Identifizierung von Normal-Alkenen, Cyclopentenen und -Hexenen mittels Kapillar-Gas-Chromatographie. Identification des alcènes, cyclopentènes et -hexènes à l'aide de la chromatogrpahie en phase gazeuse sur colonne capillaire,
Chromatographia, 1972, 5, 11, 229-239, https://doi.org/10.1007/BF02270600
. [all data]
Soják and Bucinská, 1970
Soják, L.; Bucinská, A.,
Open tubular column gas chromatography of dehydrogenation products of C6-C10 n-alkanes. Separation and identification of mixtures of C6-C10 straight-chain alkanes, alkenes and aromatics,
J. Chromatogr., 1970, 51, 75-82, https://doi.org/10.1016/S0021-9673(01)96841-4
. [all data]
Rang, Orav, et al., 1988
Rang, S.A.; Orav, A.E.; Kuningas, K.R.; Meister, A.E.; Strense, T.V.; Eisen, O.G.,
Gas-Chromatographic Characteristics of unsaturated hydrocarbons, Academy of Sciences of Estonia SSR, Tallinn, Estonia SSR, 1988, 208. [all data]
Orav and Eisen, 1972
Orav, A.; Eisen, O.,
The retention indexes for alkenes, alkynes and cyclenes on capillary columns,
Izv. Akad. Nauk Est. SSR, Khim. Geol., 1972, 21, 1, 39-47. [all data]
Umano and Shibamoto, 1987
Umano, K.; Shibamoto, T.,
Analysis of headspace volatiles from overheated beef fat,
J. Agric. Food Chem., 1987, 35, 1, 14-18, https://doi.org/10.1021/jf00073a004
. [all data]
White, Hackett, et al., 1992
White, C.M.; Hackett, J.; Anderson, R.R.; Kail, S.; Spock, P.S.,
Linear temperature programmed retention indices of gasoline range hydrocarbons and chlorinated hydrocarbons on cross-linked polydimethylsiloxane,
J. Hi. Res. Chromatogr., 1992, 15, 2, 105-120, https://doi.org/10.1002/jhrc.1240150211
. [all data]
Orav, Kailas, et al., 1999
Orav, A.; Kailas, T.; Muurisepp, M.; Kann, J.,
Composition of the oil from waste tires. 1. Fraction boiling at yp to 160 0C,
Proc. Estonian Acad. Sci. Chem., 1999, 48, 1, 30-39. [all data]
Junkes, Castanho, et al., 2003
Junkes, B.S.; Castanho, R.D.M.; Amboni, C.; Yunes, R.A.; Heinzen, V.E.F.,
Semiempirical Topological Index: A Novel Molecular Descriptor for Quantitative Structure-Retention Relationship Studies,
Internet Electronic Journal of Molecular Design, 2003, 2, 1, 33-49. [all data]