3,4-Diethyl hexane
- Formula: C10H22
- Molecular weight: 142.2817
- IUPAC Standard InChIKey: VBZCRMTUDYIWIH-UHFFFAOYSA-N
- CAS Registry Number: 19398-77-7
- Chemical structure:
View 3d structure (requires JavaScript / HTML 5) - Other names: Hexane, 3,4-diethyl-; 3,3-Diethylhexane

Phase change data

Data compiled as indicated in comments:
TRC - Thermodynamics Research Center, NIST Boulder Laboratories, Chris Muzny director
AC - William E. Acree, Jr., James S. Chickos
Quantity | Value | Units | Method | Reference | Comment |
---|---|---|---|---|---|
Tboil | 430.7 | K | N/A | Sokolova, 1953 | Uncertainty assigned by TRC = 2. K; TRC |
Tboil | 435.9 | K | N/A | Kinney and Spliethoff, 1949 | Uncertainty assigned by TRC = 1.5 K; TRC |
Quantity | Value | Units | Method | Reference | Comment |
ΔvapH° | 47.7 | kJ/mol | N/A | Reid, 1972 | AC |

Kovats' RI, non-polar column, isothermal

Column type | Active phase | Temperature (C) | I | Reference | Comment |
---|---|---|---|---|---|
Capillary | Squalane | 100. | 946. | Heinzen, Soares, et al., 1999 | |
Capillary | Squalane | 60. | 945.8 | Chretien and Dubois, 1976 | |
Capillary | Squalane | 60. | 946. | Matukuma, 1969 | N2; Column length: 91.4 m; Column diameter: 0.25 mm |

Kovats' RI, non-polar column, temperature ramp

Column type | Active phase | I | Reference | Comment |
---|---|---|---|---|
Capillary | OV-101 | 937. | Hayes and Pitzer, 1982 | 110. m/0.25 mm/0.20 μm, He, 1. K/min; Tstart: 35. C; Tend: 200. C |

Van Den Dool and Kratz RI, non-polar column, temperature ramp

Column type | Active phase | I | Reference | Comment |
---|---|---|---|---|
Capillary | SE-30 | 939.5 | Krupcík, Repka, et al., 1987 | 60. m/0.25 mm/1. μm, H2, 1. K/min; Tstart: 60. C |
Capillary | OV-101 | 937. | Hayes and Pitzer, 1981 | 108. m/0.25 mm/0.2 μm, 1. K/min; Tstart: 35. C; Tend: 200. C |

Normal alkane RI, non-polar column, isothermal

Column type | Active phase | Temperature (C) | I | Reference | Comment |
---|---|---|---|---|---|
Capillary | Apiezon L | 40. to 190. | 979. | Mann, Mühlstädt, et al., 1967 | Column length: 2. m |

Normal alkane RI, non-polar column, custom temperature program

Column type | Active phase | I | Reference | Comment |
---|---|---|---|---|
Capillary | OV-101 | 954. | Du and Liang, 2003 | Program: not specified |
Capillary | OV-101 | 946. | Du and Liang, 2003 | Program: not specified |
Capillary | Polydimethyl siloxane | 954. | Junkes, Castanho, et al., 2003 | Program: not specified |
Capillary | Polydimethyl siloxane | 946. | Junkes, Castanho, et al., 2003 | Program: not specified |
Capillary | OV-1, SE-30, Methyl silicone, SP-2100, OV-101, DB-1, etc. | 937. | Waggott and Davies, 1984 | Hydrogen; Column length: 50. m; Column diameter: 0.32 mm; Program: not specified |

Henry's Law data

Data compiled by: Rolf Sander

Henry's Law constant (water solution)

kH(T) = H exp(d(ln(kH))/d(1/T) ((1/T) - 1/(298.15 K)))
H = Henry's law constant for solubility in water at 298.15 K (mol/(kg*bar))
d(ln(kH))/d(1/T) = Temperature dependence constant (K)

H (mol/(kg*bar)) d(ln(kH))/d(1/T) (K) Method Reference Comment
0.00014 QN/A missing citation give several references for the Henry's law constants but don't assign them to specific species.

References

Sokolova, 1953
Sokolova, E.B.,
Zh. Obshch. Khim., 1953, 23, 2002. [all data]
Kinney and Spliethoff, 1949
Kinney, C.R.; Spliethoff, W.L.,
A System of Correlating Molecular Structure of Organic Compounds with Boiling Points VII. New Boiling Pts. for Certain Paraffins and Olefins,
J. Org. Chem., 1949, 14, 71. [all data]
Reid, 1972
Reid, Robert C.,
Handbook on vapor pressure and heats of vaporization of hydrocarbons and related compounds, R. C. Wilhort and B. J. Zwolinski, Texas A Research Foundation. College Station, Texas(1971). 329 pages.$10.00,
AIChE J., 1972, 18, 6, 1278-1278, https://doi.org/10.1002/aic.690180637
. [all data]