Benzene, 1-bromo-2,6-dichloro-
- Formula: C6H3BrCl2
- Molecular weight: 225.898
- IUPAC Standard InChIKey: UWOIDOQAQPUVOH-UHFFFAOYSA-N
- CAS Registry Number: 19393-92-1
- Chemical structure:
View 3d structure (requires JavaScript / HTML 5) - Other names: 1-Bromo-2,6-dichlorobenzene; 2-Bromo-1,3-dichlorobenzene; 1,3-Dichloro-2-bromobenzene; 2,6-Dichlorobromobenzene; Benzene, 2-bromo-1,3-dichloro-

Phase change data

Data compiled by: Robert L. Brown and Stephen E. Stein
Quantity | Value | Units | Method | Reference | Comment |
---|---|---|---|---|---|
Tboil | 515. | K | N/A | Buckingham and Donaghy, 1982 | |
Quantity | Value | Units | Method | Reference | Comment |
Tfus | 338. | K | N/A | Buckingham and Donaghy, 1982 |
Reduced pressure boiling point
Tboil (K) | Pressure (bar) | Reference |
---|---|---|
515.2 | 1.02 | Weast and Grasselli, 1989 |

References

Buckingham and Donaghy, 1982
Buckingham, J.; Donaghy, S.M.,
Dictionary of Organic Compounds: Fifth Edition, Chapman and Hall, New York, 1982, 1. [all data]
Weast and Grasselli, 1989
CRC Handbook of Data on Organic Compounds, 2nd Editon, Weast,R.C and Grasselli, J.G., ed(s)., CRC Press, Inc., Boca Raton, FL, 1989, 1. [all data]