1-Ethyl-1,3-cyclohexadiene
- Formula: C8H12
- Molecular weight: 108.1809
- IUPAC Standard InChIKey: WZMQOSYJAAMGTB-UHFFFAOYSA-N
- CAS Registry Number: 19381-80-7
- Chemical structure:
View 3d structure (requires JavaScript / HTML 5) - Permanent link for this species. Use this link for bookmarking this species for future reference.

Reaction thermochemistry data

Data compiled by: Hussein Y. Afeefy, Joel F. Liebman, and Stephen E. Stein
Individual Reactions
By formula: C8H12 = C8H12
Quantity | Value | Units | Method | Reference | Comment |
---|---|---|---|---|---|
ΔrH° | -0.1 ± 0.2 | kJ/mol | Eqk | Taskinen and Nummelin, 1994 | liquid phase; solvent: Dimethylsulfoxide |
By formula: C8H12 = C8H12
Quantity | Value | Units | Method | Reference | Comment |
---|---|---|---|---|---|
ΔrH° | 2.8 ± 1.2 | kJ/mol | Eqk | Taskinen and Nummelin, 1994 | liquid phase; solvent: Dimethylsulfoxide |

References

Taskinen and Nummelin, 1994
Taskinen, E.; Nummelin, K.,
Relative thermodynamic stabilities of 3-ethylidenecyclohexenes and isomeric ethylcyclohexadienes,
Tetrahedron, 1994, 50, 11693-11698. [all data]