Cyclopentane, 1,2,3-trimethyl-, (1α,2β,3α)-
- Formula: C8H16
- Molecular weight: 112.2126
- IUPAC Standard InChIKey: VCWNHOPGKQCXIQ-JIGDXULJSA-N
- CAS Registry Number: 19374-46-0
- Chemical structure:
View 3d structure (requires JavaScript / HTML 5) - Species with the same structure:
- Stereoisomers:
- Other names: r-1,t-2,c-3-trimethylcyclopentane

Phase change data

Data compiled by: Thermodynamics Research Center, NIST Boulder Laboratories, Chris Muzny director
Quantity | Value | Units | Method | Reference | Comment |
---|---|---|---|---|---|
Tboil | 383. ± 2. | K | AVG | N/A | Average of 6 values; Individual data points |
Quantity | Value | Units | Method | Reference | Comment |
Tfus | 160.42 ± 0.02 | K | AVG | N/A | Average of 7 values; Individual data points |

Kovats' RI, non-polar column, isothermal

Data compiled by: NIST Mass Spectrometry Data Center, William E. Wallace, director

Column type CapillaryCapillaryCapillaryCapillaryCapillary
Active phase SqualaneSqualaneSqualaneSqualaneSqualane
Column length (m) 50.50.120.120.100.
Carrier gas HeHeHeHeN2
Substrate
Column diameter (mm) 0.220.220.250.250.25
Phase thickness (μm)
Temperature (C) 50.70.100.100.50.
I 747.4750.55751.7751.7748.
ReferenceLunskii and Paizanskaya, 1988Lunskii and Paizanskaya, 1988Lulova, Leont'eva, et al., 1976Lulova, Leont'eva, et al., 1976Rijks and Cramers, 1974
Comment MSDC-RI MSDC-RI MSDC-RI MSDC-RI MSDC-RI
Column type CapillaryCapillaryCapillaryCapillaryCapillary
Active phase SqualaneVacuum Grease Oil (VM-4)Vacuum Grease Oil (VM-4)Vacuum Grease Oil (VM-4)Vacuum Grease Oil (VM-4)
Column length (m) 100.
Carrier gas N2
Substrate
Column diameter (mm) 0.25
Phase thickness (μm)
Temperature (C) 70.35.45.50.58.
I 751.745.748.748.750.
ReferenceRijks and Cramers, 1974Sidorov, Petrova, et al., 1972Sidorov, Petrova, et al., 1972Sidorov, Petrova, et al., 1972Sidorov, Petrova, et al., 1972
Comment MSDC-RI MSDC-RI MSDC-RI MSDC-RI MSDC-RI
Column type CapillaryPackedPackedPackedPacked
Active phase Vacuum Grease Oil (VM-4)Vacuum Grease Oil (VM-4)SE-30SqualaneSqualane
Column length (m)   6.115.15.
Carrier gas   N2HeHe
Substrate   Chromosorb WChromosorb PChromosorb P
Column diameter (mm)    0.250.25
Phase thickness (μm)
Temperature (C) 68.35.130.27.49.
I 752.745.766.744.748.
ReferenceSidorov, Petrova, et al., 1972Sidorov, Ivanova, et al., 1971Mitra and Saha, 1970Hively and Hinton, 1968Hively and Hinton, 1968
Comment MSDC-RI MSDC-RI MSDC-RI MSDC-RI MSDC-RI
Column type PackedPacked
Active phase SqualaneSqualane
Column length (m) 15.15.
Carrier gas HeHe
Substrate Chromosorb PChromosorb P
Column diameter (mm) 0.250.25
Phase thickness (μm)
Temperature (C) 67.86.
I 751.754.
ReferenceHively and Hinton, 1968Hively and Hinton, 1968
Comment MSDC-RI MSDC-RI

References

No reference data available.