2,2-Dimethylthiazolidine
- Formula: C5H11NS
- Molecular weight: 117.213
- IUPAC Standard InChIKey: SNPQRYOQWLOTFA-UHFFFAOYSA-N
- CAS Registry Number: 19351-18-9
- Chemical structure:
View 3d structure (requires JavaScript / HTML 5) - Other names: Thiazolidine, 2,2-dimethyl-; 2,2-Dimethyl-1,3-thiazolidine

Phase change data

Data compiled by: Robert L. Brown and Stephen E. Stein
Quantity | Value | Units | Method | Reference | Comment |
---|---|---|---|---|---|
Tboil | 418. | K | N/A | Frinton Laboratories Inc., 1986 |

Van Den Dool and Kratz RI, polar column, temperature ramp

Column type | Active phase | I | Reference | Comment |
---|---|---|---|---|
Capillary | DB-Wax | 1395. | Chung, Eiserich, et al., 1994 | He, 60. C @ 4. min, 3. K/min, 220. C @ 30. min; Column length: 60. m; Column diameter: 0.25 mm |

Normal alkane RI, non-polar column, custom temperature program

Column type | Active phase | I | Reference | Comment |
---|---|---|---|---|
Capillary | DB-5 | 952. | Didzbalis and Ho, 2001 | 60. m/0.25 mm/0.25 μm, Helium; Program: 35 0C (2 min) 30 0C/min -> 60 0C (1 min) 6 0C/min -> 250 0C (10 min) |

References

Frinton Laboratories Inc., 1986
Frinton Laboratories Inc.,
Catalog Number 11, Frinton Laboratories Inc., Vineland, NJ, 1986, 99. [all data]
Chung, Eiserich, et al., 1994
Chung, T.Y.; Eiserich, J.P.; Shibamoto, T.,
Volatile compounds produced from peanut oil heated with different amounts of cysteine,
J. Agric. Food Chem., 1994, 42, 8, 1743-1746, https://doi.org/10.1021/jf00044a032
. [all data]
Didzbalis and Ho, 2001
Didzbalis, J.; Ho, C.-T.,
Analysis of low molecular weight aldehydes formed during the Mallard reaction,
ACS Symposium Series, 2001, 794, 196-107. [all data]