Indeno[1,2,3-cd]fluoranthene
- Formula: C22H12
- Molecular weight: 276.3307
- IUPAC Standard InChIKey: XAKRHFYJDSMEMI-UHFFFAOYSA-N
- CAS Registry Number: 193-43-1
- Chemical structure:
View 3d structure (requires JavaScript / HTML 5) - Permanent link for this species. Use this link for bookmarking this species for future reference.

Gas phase thermochemistry data

Data compiled by: Glushko Thermocenter, Russian Academy of Sciences, Moscow
Constant pressure heat capacity of gas
Cp,gas (J/mol*K) | Temperature (K) | Reference | Comment |
---|---|---|---|
49.71 | 50. | Dorofeeva O.V., 1989 | These statistically calculated values were obtained using force field approximation for polycyclic aromatic hydrocarbons to estimate the needed vibrational frequencies (see also [ Dorofeeva O.V., 1986, Moiseeva N.F., 1990]). These functions are reproduced in the reference book [ Frenkel M., 1994]. |
82.78 | 100. | ||
121.86 | 150. | ||
166.82 | 200. | ||
238.52 | 273.15 | ||
263.3 ± 6.0 | 298.15 | ||
265.16 | 300. | ||
358.67 | 400. | ||
437.10 | 500. | ||
499.77 | 600. | ||
549.57 | 700. | ||
589.55 | 800. | ||
622.10 | 900. | ||
648.92 | 1000. | ||
671.25 | 1100. | ||
690.00 | 1200. | ||
705.86 | 1300. | ||
719.37 | 1400. | ||
730.93 | 1500. |

Phase change data

Data compiled by: William E. Acree, Jr., James S. Chickos
Enthalpy of fusion
ΔfusH (kJ/mol) | Temperature (K) | Method | Reference |
---|---|---|---|
23.2 | 542.3 | DSC | Kestens, Auclair, et al., 2010 |

Lee's RI, non-polar column, temperature ramp

Column type | Active phase | I | Reference | Comment |
---|---|---|---|---|
Capillary | HP-5 | 490.85 | Pedersen, Durant, et al., 2005 | 30. m/0.25 mm/0.25 μm, Helium, 50. C @ 1.5 min, 6. K/min, 310. C @ 10. min |
Capillary | HP-5 | 484.67 | Marynowski, Pieta, et al., 2004 | 60. m/0.25 mm/0.25 μm, He, 3. K/min; Tstart: 35. C; Tend: 300. C |

Lee's RI, non-polar column, custom temperature program

Column type | Active phase | I | Reference | Comment |
---|---|---|---|---|
Capillary | HP-5MS | 488.38 | Wang, Li, et al., 2007 | 30. m/0.25 mm/0.25 μm, He; Program: 60C(2min) => 6C/min => 258C => 2C/min => 300C(4min) |
Capillary | HP-5MS | 488.38 | Wang, Li, et al., 2007, 2 | 30. m/0.25 mm/0.25 μm, He; Program: not specified |

References

Dorofeeva O.V., 1989
Dorofeeva O.V.,
Thermodynamic Properties of Gaseous Polycyclic Aromatic Hydrocarbons Containing Five-Membered Rings. Institute for High Temperatures, USSR Academy of Sciences, Preprint No.1-263 (in Russian), Moscow, 1989. [all data]
Dorofeeva O.V., 1986
Dorofeeva O.V.,
On calculation of thermodynamic properties of polycyclic aromatic hydrocarbons,
Thermochim. Acta, 1986, 102, 59-66. [all data]
Moiseeva N.F., 1990
Moiseeva N.F.,
Group additivity scheme for calculating the chemical thermodynamic properties of gaseous polycyclic aromatic hydrocarbons containing five-membered rings,
Thermochim. Acta, 1990, 168, 179-186. [all data]
Frenkel M., 1994
Frenkel M.,
Thermodynamics of Organic Compounds in the Gas State, Vol. I, II, Thermodynamics Research Center, College Station, Texas, 1994, 1994. [all data]
Kestens, Auclair, et al., 2010
Kestens, Vikram; Auclair, Guy; Drozdzewska, Katarzyna; Held, Andrea; Roebben, Gert; Linsinger, Thomas,
Thermodynamic property values of selected polycyclic aromatic hydrocarbons measured by differential scanning calorimetry,
J Therm Anal Calorim, 2010, 99, 1, 245-261, https://doi.org/10.1007/s10973-009-0440-6
. [all data]
Pedersen, Durant, et al., 2005
Pedersen, D.U.; Durant, J.L.; Taghizadeh, K.; Hemond, H.F.; Lafleur, A.L.; Cass, G.R.,
Human cell mutagenes in respirable airborne particles from the Northeastern United States. 2. Quantification of mutagenes and other organic compounds.,
Environ. Sci. Technol., 2005, 39, 24, 9547-9560, https://doi.org/10.1021/es050886c
. [all data]
Marynowski, Pieta, et al., 2004
Marynowski, L.; Pieta, M.; Janeczek, J.,
Composition and source of polycyclic aromatic compounds in deposited dust from selected sites around the Upper Silesia, Poland,
Geol. Q., 2004, 48, 2, 169-180. [all data]
Wang, Li, et al., 2007
Wang, Z.; Li, K.; Lambert, P.; Yang, C.,
Identification, characterization and quantitation of pyrogenic polycylic aromatic hydrocarbons and other organic compounds in tire fire products,
J. Chromatogr. A, 2007, 1139, 1, 14-26, https://doi.org/10.1016/j.chroma.2006.10.085
. [all data]
Wang, Li, et al., 2007, 2
Wang, Z.; Li, K.; Lambert, P.; Brown, C.E.; Yang, C.; Hollebone, B.P.,
Identification and characterization of polycyclic aromatic compounds in tire fire products and differentiation of pyrogenic PAHs from petrogenic PAHs
in Proceedings of the 30th Arctic and Marine Oilspill (AMOP) Technical Seminar. Vol.1, 2007, 61-85. [all data]