Triethylene glycol, octyl ether
- Formula: C14H30O4
- Molecular weight: 262.3856
- IUPAC Standard InChIKey: XIVLVYLYOMHUGB-UHFFFAOYSA-N
- CAS Registry Number: 19327-38-9
- Chemical structure:
View 3d structure (requires JavaScript / HTML 5) - Other names: Triethylene glycol, monooctyl ether; 2-[2-[2-(octyloxy)ethoxy]ethoxy]ethanol

Kovats' RI, non-polar column, isothermal

Column type | Active phase | Temperature (C) | I | Reference | Comment |
---|---|---|---|---|---|
Packed | SE-30 | 170. | 1855. | Voelkel, 1987 | He, Chromaton N Super (75-100 mesh); Column length: 1. m |

References

Voelkel, 1987
Voelkel, A.,
Retention Indices and Thermodynamic Functions of Solution for Model Non-Ionic Surfactants in Standard Stationary Phases Determined by Gas Chromatography,
J. Chromatogr., 1987, 387, 95-104, https://doi.org/10.1016/S0021-9673(01)94516-9
. [all data]