N-(4-Nitrophenyl)-N'-phenyl-urea
- Formula: C13H11N3O3
- Molecular weight: 257.2447
- IUPAC Standard InChIKey: QHHPMKKJBURYIQ-UHFFFAOYSA-N
- CAS Registry Number: 1932-32-7
- Chemical structure:
View 3d structure (requires JavaScript / HTML 5) - Other names: Urea, N-(4-nitrophenyl)-N'-phenyl-

Reaction thermochemistry data

Data compiled by: Hussein Y. Afeefy, Joel F. Liebman, and Stephen E. Stein
Individual Reactions
By formula: C7H4N2O3 + C6H7N = C13H11N3O3
Quantity | Value | Units | Method | Reference | Comment |
---|---|---|---|---|---|
ΔrH° | -83.8 ± 0.3 | kJ/mol | Cm | Kiselev, Malkov, et al., 1989 | liquid phase; solvent: Dioxane; #TDE |

References

Kiselev, Malkov, et al., 1989
Kiselev, V.D.; Malkov, V.B.; Murzin, D.G.; Shakirov, I.M.; Konovalov, A.I.,
Thermochemical study of the reaction of isocyanate with amines,
Dokl. Phys. Chem. (Engl. Transl.), 1989, 308, 711-713, In original 111. [all data]