Norfuronol
- Formula: C5H6O3
- Molecular weight: 114.0993
- IUPAC Standard InChIKey: DLVYTANECMRFGX-UHFFFAOYSA-N
- CAS Registry Number: 19322-27-1
- Chemical structure:
View 3d structure (requires JavaScript / HTML 5) - Species with the same structure:
- Other names: 3(2H)-Furanone, 4-hydroxy-5-methyl-; 4-hydroxy-5-methylfuran-3(2H)-one; Norfuraneol

Van Den Dool and Kratz RI, non-polar column, temperature ramp

Column type | Active phase | I | Reference | Comment |
---|---|---|---|---|
Capillary | ZB-5 | 1054. | Bell, 2004 | 30. m/0.32 mm/0.50 μm, Helium, 7. K/min, 265. C @ 5. min; Tstart: 40. C |

Van Den Dool and Kratz RI, non-polar column, custom temperature program

Column type | Active phase | I | Reference | Comment |
---|---|---|---|---|
Capillary | DB-5 | 1087. | Klesk and Qian, 2003 | 30. m/0.25 mm/0.25 μm, He; Program: 40C(2min) => 5C/min => 100C => 4C/min => 230C(10min) |
Capillary | DB-5 | 1042. | Engel and Schieberle, 2002 | 30. m/0.32 mm/0.25 μm, He; Program: 40C (2min) => 40C/min => 60C (1min) => 6C/min => 230C (15min) |
Capillary | SE-54 | 1040. | Fickert and Schieberle, 1998 | 25. m/0.32 mm/0.5 μm, He; Program: 35C (2min) => 4C/min => 150C => 10C/min => 240C |
Capillary | SE-54 | 1044. | Hofmann and Schieberle, 1995 | 30. m/0.32 mm/0.25 μm, He; Program: 40C (2min) => 40C/min => 50C (5min) => 6C/min => 230C (15min) |

Van Den Dool and Kratz RI, polar column, temperature ramp

Column type | Active phase | I | Reference | Comment |
---|---|---|---|---|
Capillary | DB-Wax | 2124. | Bell, 2004 | 30. m/0.32 mm/0.50 μm, Helium, 7. K/min, 240. C @ 5. min; Tstart: 40. C |

Van Den Dool and Kratz RI, polar column, custom temperature program

Column type | Active phase | I | Reference | Comment |
---|---|---|---|---|
Capillary | Stabilwax | 2114. | Klesk and Qian, 2003 | 30. m/0.32 mm/1. μm, He; Program: 40C(2min) => 5C/min => 100C => 4C/min => 230C(10min) |
Capillary | FFAP | 2120. | Engel and Schieberle, 2002 | 30. m/0.32 mm/0.25 μm, He; Program: 40C (2min) => 40C/min => 60C (1min) => 6C/min => 230C (15min) |
Capillary | FFAP | 2117. | Fickert and Schieberle, 1998 | 25. m/0.32 mm/0.5 μm, He; Program: 35C (2min) => 40C/min => 60C => 6C/min => 230C (10min) |
Capillary | FFAP | 2105. | Hofmann and Schieberle, 1995 | 30. m/0.32 mm/0.25 μm, He; Program: 40C (2min) => 40C/min => 60C (5min) => 6C/min => 230C (15min) |

Normal alkane RI, non-polar column, custom temperature program

Column type | Active phase | I | Reference | Comment |
---|---|---|---|---|
Capillary | Polydimethyl siloxane | 1075. | Xu, He, et al., 2010 | Program: 40 0C 20 0C/min -> 60 0C (5 min) 4 0C/min -> 250 0C |

Normal alkane RI, polar column, temperature ramp

Column type | Active phase | I | Reference | Comment |
---|---|---|---|---|
Capillary | DB-Wax | 2123. | Culleré, Escudero, et al., 2004 | 30. m/0.32 mm/0.5 μm, H2, 40. C @ 5. min, 4. K/min; Tend: 200. C |
Capillary | DB-Wax | 2114. | Sekiwa, Kubota, et al., 1997 | He, 2. K/min; Column length: 60. m; Column diameter: 0.25 mm; Tstart: 60. C; Tend: 180. C |

References

Bell, 2004
Bell, W.A.-M.,
Examination of Aroma Volatiles Formed from Thermal Processing of Florida Reconstituted Grapefruit Juice. A Thesis presented to the graduate school of the university of Florida in partial fulfillment of the requirements for the degree of master of science, 2004. [all data]
Klesk and Qian, 2003
Klesk, K.; Qian, M.,
Aroma extract dilution analysis of Cv. Marion (Rubus spp. hyb) and Cv. Evergreen (R. Iaciniatus L.) blackberries,
J. Agric. Food Chem., 2003, 51, 11, 3436-3441, https://doi.org/10.1021/jf0262209
. [all data]
Engel and Schieberle, 2002
Engel, W.; Schieberle, P.,
Identification and quantitation of key aroma compounds formed in Maillard-type reactions of fructose with cysteamine or isothiaproline (1,3-thiazolidine-2-carboxylic acid),
J. Agric. Food Chem., 2002, 50, 19, 5394-5399, https://doi.org/10.1021/jf0203186
. [all data]
Fickert and Schieberle, 1998
Fickert, B.; Schieberle, P.,
Identification of the key odorants in barley malt (caramalt) using GC/MS techniques and odour dilution analyses,
Nahrung, 1998, 42, 6, 371-375, https://doi.org/10.1002/(SICI)1521-3803(199812)42:06<371::AID-FOOD371>3.0.CO;2-V
. [all data]
Hofmann and Schieberle, 1995
Hofmann, T.; Schieberle, P.,
Evaluation of the key odorants in a thermally treated solution of ribose and cysteine by aroma extract dilution techniques,
J. Agric. Food Chem., 1995, 43, 8, 2187-2194, https://doi.org/10.1021/jf00056a042
. [all data]
Xu, He, et al., 2010
Xu, H.; He, W.; Liu, X.; Gao, Y.,
Effect of pressure on the Maillard reaction between ribose and cysteine in supercritical carbon dioxide,
Czech J. Food Sci., 2010, 28, 3, 192-201. [all data]
Culleré, Escudero, et al., 2004
Culleré, L.; Escudero, A.; Cacho, J.; Ferreira, V.,
Gas chromatography-olfactometry and chemical quantitative study of the aroma of six premium auality Spanish aged red wines,
J. Agric. Food Chem., 2004, 52, 6, 1653-1660, https://doi.org/10.1021/jf0350820
. [all data]
Sekiwa, Kubota, et al., 1997
Sekiwa, Y.; Kubota, K.; Kobayashi, A.,
Characteristic flavor components in the brew of cooked clam (Meretrix lusoria) and the effect of storage on flavor formation,
J. Agric. Food Chem., 1997, 45, 3, 826-830, https://doi.org/10.1021/jf960433e
. [all data]