Nitrapyrin
- Formula: C6H3Cl4N
- Molecular weight: 230.907
- IUPAC Standard InChIKey: DCUJJWWUNKIJPH-UHFFFAOYSA-N
- CAS Registry Number: 1929-82-4
- Chemical structure:
View 3d structure (requires JavaScript / HTML 5) - Other names: Pyridine, 2-chloro-6-(trichloromethyl)-; N-Serve; 2-Chloro-6-(trichloromethyl)pyridine; 2-Picoline, α,α,α,6-tetrachloro-; Dowco-163; N-Serve nitrogen stabilizer

Condensed phase thermochemistry data

Data compiled as indicated in comments:
ALS - Hussein Y. Afeefy, Joel F. Liebman, and Stephen E. Stein
DH - Eugene S. Domalski and Elizabeth D. Hearing
Quantity | Value | Units | Method | Reference | Comment |
---|---|---|---|---|---|
ΔfH°liquid | 498.3 | kJ/mol | Cm | Bessarab, Emel'yanov, et al., 1983 | ALS |
Quantity | Value | Units | Method | Reference | Comment |
ΔcH°liquid | -2711. ± 20. | kJ/mol | Cm | Bessarab, Emel'yanov, et al., 1983 | ALS |
Quantity | Value | Units | Method | Reference | Comment |
ΔfH°solid | -55.4 ± 1.8 | kJ/mol | Ccr | Tan, Kamaguchi, et al., 1989 | ALS |
Quantity | Value | Units | Method | Reference | Comment |
ΔcH°solid | -2830.8 ± 1.6 | kJ/mol | Ccr | Tan, Kamaguchi, et al., 1989 | ALS |
Quantity | Value | Units | Method | Reference | Comment |
S°solid,1 bar | 244.596 | J/mol*K | N/A | Tan, Sorai, et al., 1989 | DH |
Constant pressure heat capacity of solid
Cp,solid (J/mol*K) | Temperature (K) | Reference | Comment |
---|---|---|---|
189.35 | 298.15 | Tan, Sorai, et al., 1989 | T = 2 to 400 K.; DH |
192.09 | 297.13 | Tan, Ye, et al., 1987 | T = 78 to 322 K. Value is unsmoothed experimental datum. Cp(c,70 to 330 K) = 146.438 + 57.0749X - 1.31699x2 + 16.2918x3 - 11.3899x4 - 26.7611x5 + 5.59976X6 + 21.3037X7 (J/mol*K).; DH |

Phase change data

Data compiled as indicated in comments:
TRC - Thermodynamics Research Center, NIST Boulder Laboratories, Chris Muzny director
ALS - Hussein Y. Afeefy, Joel F. Liebman, and Stephen E. Stein
DH - Eugene S. Domalski and Elizabeth D. Hearing
AC - William E. Acree, Jr., James S. Chickos
Quantity | Value | Units | Method | Reference | Comment |
---|---|---|---|---|---|
Tfus | 339.03 | K | N/A | Donnelly, Drewes, et al., 1990 | Uncertainty assigned by TRC = 0.2 K; TRC |
Quantity | Value | Units | Method | Reference | Comment |
Ttriple | 337.240 | K | N/A | Tan, Ye, et al., 1987, 2 | Uncertainty assigned by TRC = 0.01 K; TRC |
Quantity | Value | Units | Method | Reference | Comment |
ΔvapH° | 58.70 | kJ/mol | V | Bessarab, Emel'yanov, et al., 1983 | ALS |
Enthalpy of fusion
ΔfusH (kJ/mol) | Temperature (K) | Method | Reference | Comment |
---|---|---|---|---|
20.300 | 337.242 | N/A | Tan, Sorai, et al., 1989 | DH |
20.2988 | 337.242 | N/A | Tan, Ye, et al., 1987 | DH |
20.3 | 337.8 | AC | Domalski and Hearing, 1996 | Based on data from 13. to 316. K.; AC |
Entropy of fusion
ΔfusS (J/mol*K) | Temperature (K) | Reference | Comment |
---|---|---|---|
60.19 | 337.242 | Tan, Sorai, et al., 1989 | DH |
60.190 | 337.242 | Tan, Ye, et al., 1987 | DH |

References

Bessarab, Emel'yanov, et al., 1983
Bessarab, N.A.; Emel'yanov, V.L.; Stul, B.Ya.; Platonov, V.A.; Simulin, Yu.N.; Dzhagatspanyan, R.V.,
Vapor pressure of some chlorine derivatives of 2-picoline, Deposited Document, VINITI 2994-83. Chem. Abst. 101:43847c, 1983, 1-7. [all data]
Tan, Kamaguchi, et al., 1989
Tan, Z.; Kamaguchi, A.; Nagano, Y.; Sakiyama, M.,
Standard enthalpy of formation of 2-chloro-6-(trichloromethyl)pyridine,
J. Chem. Thermodyn., 1989, 21, 615-623. [all data]
Tan, Sorai, et al., 1989
Tan, A.-C.; Sorai, M.; Suga, H.,
Low-temperature heat capacity and thermodynamic functions of 2-chloro-6-(trichloromethyl)pyridine,
Sci. China Ser. B, 1989, 32(10), 1194-1207. [all data]
Tan, Ye, et al., 1987
Tan, Z.; Ye, J.; Yin, A.; Chen, S.; Wang, W.,
Heat capacity and thermodynamic properties of 2-chloro-6-(trichloromethyl)pyridine,
Kexue Tongbao, 1987, 32(4), 240-246. [all data]
Donnelly, Drewes, et al., 1990
Donnelly, J.R.; Drewes, L.A.; Johnson, R.L.; Munslow, W.D.; Knapp, K.K.; Sovocool, G.W.,
Purity and heat of fusion data for environmental standards as determined by differential scanning calorimetry,
Thermochim. Acta, 1990, 167, 2, 155, https://doi.org/10.1016/0040-6031(90)80476-F
. [all data]
Tan, Ye, et al., 1987, 2
Tan, Z.; Ye, J.; Yin, A.; Chen, S.; Wang, W.,
Heat capacity and thermodynamic properties of 2-chloro-6-(trichloromethyl)pyridine,
Kexue Tongbao (Foreign Lang. Ed.), 1987, 32, 240-6. [all data]
Domalski and Hearing, 1996
Domalski, Eugene S.; Hearing, Elizabeth D.,
Heat Capacities and Entropies of Organic Compounds in the Condensed Phase. Volume III,
J. Phys. Chem. Ref. Data, 1996, 25, 1, 1, https://doi.org/10.1063/1.555985
. [all data]